{"text_format":"1","workbook":"xlsx","n_sheets":9,"sheets":["BA-Teilnehmer","Auslosung_Turnierdaten","SP64","Viertelfinale","Baum 64","Paarung drucken","Tabelle","BA-Export","Mitglieder"],"not_rendered":{"charts":0,"images":0,"macros":1,"external_links":1,"defined_names":7,"comments":0,"pivot_tables":0},"unopened":[],"bounds":{"document_bytes":16777216,"sheet_cells":100000,"rows_first":2000,"rows_last":500,"rows_between":2000,"halvings":0,"cell_chars":16384,"cell_head_chars":4096},"cells_cut":0,"cells_raw":0,"read":"whole","date_system":"1900"}

{"sheet":"BA-Teilnehmer","index":0,"n_rows":69,"n_cols":10,"rows_kept":69,"cut":false,"hidden":false,"merged":[[0,1,0,5],[1,1,1,5],[2,1,2,5]]}
[null,"Einloggen - \"Spielbetrieb Verband\" - \"Ergebnisse Turnier\" - Meisterschaft auswählen - \"Spielergebnisse bearbeiten\" -"]
[null,"Teilnehmerliste dann kopieren und in markierten Bereich einfügen - wenn notwendig Verein ergänzen"]
[null,"Schaltfläche \"Spieler in Spielplan übernehmen\" anwählen"]
[]
[null,"Spielernummer","Nachname","Vorname","Verein"]
[1,null,null,null,null,null,{"$f":"IF(C6 & \" \" & D6=\" \",\"\",C6 & \" \" & D6)","v":""},{"$f":"IF(E6=\"\",\"\",E6)","v":""},null,{"$f":"IF(B6=\"\",\"\",B6)","v":""}]
[2,null,null,null,null,null,"","",null,""]
[3,null,null,null,null,null,"","",null,""]
{"$rows_left_out":62}
{"sheet":"Auslosung_Turnierdaten","index":1,"n_rows":80,"n_cols":22,"rows_kept":80,"cut":false,"hidden":false,"merged":[[7,0,71,0],[7,9,39,9]]}
[]
["Bedienungsanleitung des Spielplans:"]
[]
["Bei Meisterschaften BBV, Verein, Mitliedernummer des Teilnehmers eingeben bzw aus BA-Teilnehmer übernehmen"]
["Eingabe Ergebnisse in SP64"]
["Tabelle siehe Tabelle",null,null,null,null,null,"letzter Stand 25.09.2009"]
[]
["     Achtung doppelte Namenseingabe ! - Achtung doppelte Namenseingabe !",null,null,null,null,"Name, Vorname","Verein","Vereinsnr.","Mg.Nr.","           Achtung doppelte Tischeingabe !","Tischdefinition",null,null,null,"Beginn:",null,{"$f":"COUNTA('SP64'!D3:E34)/2-COUNT('SP64'!AR3:AR34)","v":32},{"$f":"IF(AND(Q8<=$O$11,Q8>0),1,Q8/$O$11)*Auslosung_Turnierdaten!$R$23","v":{"$error":"#DIV/0!"}},"HR",null,{"$f":"MAX(U9:U72)","v":0},{"$f":"MAX(V9:V40)","v":0}]
{"$rows_left_out":73}
{"sheet":"SP64","index":2,"n_rows":131,"n_cols":49,"rows_kept":131,"cut":false,"hidden":false,"merged":[]}
[null,null,null,null,null,null,null,null,null,null,null,null,{"$f":"\"FT:\"&\" -\"&Auslosung_Turnierdaten!M9&Auslosung_Turnierdaten!M10&Auslosung_Turnierdaten!M11&Auslosung_Turnierdaten!M12&Auslosung_Turnierdaten!M13&Auslosung_Turnierdaten!M14&Auslosung_Turnierdaten!M15&Auslosung_Turnierdaten!M16&Auslosung_Turnierdaten!M17&Auslosung_Turnierdaten!M18&Auslosung_Turnierdaten!M19&Auslosung_Turnierdaten!M20&Auslosung_Turnierdaten!M21&Auslosung_Turnierdaten!M22&Auslosung_Turnierdaten!M23&Auslosung_Turnierdaten!M24&Auslosung_Turnierdaten!M25&Auslosung_Turnierdaten!M26","v":"FT: -"}]
[null,null,null,"Tln1","Tln2","Sp1","Sp2","Auf1","Auf2","HS1","HS2","Tisch",{"$f":"\"-\"&Auslosung_Turnierdaten!M27&Auslosung_Turnierdaten!M28&Auslosung_Turnierdaten!M29&Auslosung_Turnierdaten!M30&Auslosung_Turnierdaten!M31&Auslosung_Turnierdaten!M32&Auslosung_Turnierdaten!M33&Auslosung_Turnierdaten!M34&Auslosung_Turnierdaten!M35&Auslosung_Turnierdaten!M36&Auslosung_Turnierdaten!M37&Auslosung_Turnierdaten!M38&Auslosung_Turnierdaten!M39&Auslosung_Turnierdaten!M40","v":"-"},"Ges","Ges","A1g","A2g","A1+","A2+","P1","P2","Nr","Name","Pkt","P","GP","VP","Spg","GSp","VSp","Quot","Auf","GD","BED","HS","BED-Ber",null,null,null,null,null,null,null,null,"P-Beginn","P-Ende","Dauer",null,{"$f":"MAX(AW3:AW34)","v":0}]
[null,"HR",1,{"$f":"IF(W3=\"Freilos\",\"Freilos\",IF(W3=\"\",\"Spieler 1\",W3))","v":"Spieler 1"},{"$f":"IF(W35=\"Freilos\",\"Freilos\",IF(W35=\"\",\"Spieler 33\",W35))","v":"Spieler 33"},null,null,null,null,null,null,null,null,{"$f":"F3+G3","v":0},{"$f":"N3","v":0},{"$f":"IF(D3=\"Freilos\",0,IF(F3<G3,1,IF(F3>G3,1,0)))","v":0},{"$f":"IF(D3=\"Freilos\",0,IF(F3<G3,1,IF(F3>G3,1,0)))","v":0},{"$f":"IF(D3=\"Freilos\",0,IF(F3>G3,1,0))","v":0},{"$f":"IF(D3=\"Freilos\",0,IF(G3>F3,1,0))","v":0},{"$f":"IF(E3=\"Freilos\",3,IF(F3>G3,3,0))","v":0},{"$f":"IF(D3=\"Freilos\",3,IF(G3>F3,3,0))","v":0},1,{"$f":"IF(Auslosung_Turnierdaten!F9=\"\",\"Spieler 1\",Auslosung_Turnierdaten!F9)","v":"Spieler 1"},{"$f":"IF(W3=\"Freilos\",0,SUMIF($D$3:$E$129,W3,$T$3:$U$129))","v":0},{"$f":"SUMIF($D$3:$E$129,W3,$P$3:$Q$129)","v":0},{"$f":"SUMIF($D$3:$E$129,W3,$R$3:$S$129)","v":0},{"$f":"Y3-Z3","v":0},{"$f":"SUMIF($D$3:$E$129,W3,$N$3:$O$129)","v":0},{"$f":"SUMIF($D$3:$E$129,W3,$F$3:$G$129)","v":0},{"$f":"AB3-AC3","v":0},{"$f":"IF(AD3>0,AC3/AD3,AC3*1.000000001)","v":0},{"$f":"SUMIF($D$3:$E$129,W3,$H$3:$I$129)","v":0},{"$f":"IF(AF3>0,AC3/AF3,0)","v":0},{"$f":"MAX(AJ3:AL3)","v":0},{"$f":"MAX(SUMIF($D$3:$E$34,W3,$J$3:$K$34),SUMIF($D$35:$E$66,W3,$J$35:$K$66),SUMIF($D$67:$E$82,W3,$J$67:$K$82),SUMIF($D$83:$E$98,W3,$J$83:$K$98),SUMIF($D$99:$E$106,W3,$J$99:$K$106),SUMIF($D$107:$E$114,W3,$J$107:$K$114),SUMIF($D$115:$E$118,W3,$J$115:$K$118),SUMIF($D$119:$E$122,W3,$J$119:$K$122),SUMIF($D$123:$E$124,W3,$J$123:$K$124),SUMIF($D$125:$E$126,W3,$J$125:$K$126),SUMIF($D$127:$E$127,W3,$J$127:$K$127),SUMIF($D$128:$E$128,W3,$J$128:$K$128),SUMIF($D$129:$E$129,W3,$J$129:$K$129))","v":0},{"$f":"MAX(IF(AND(SUMIF($D$3:$E$34,W3,$H$3:$I$34)>0,SUMIF($D$3:$E$34,W3,$R$3:$S$34)>0),SUMIF($D$3:$E$34,W3,$F$3:$G$34)/SUMIF($D$3:$E$34,W3,$H$3:$I$34),0),IF(AND(SUMIF($D$35:$E$66,W3,$H$35:$I$66)>0,SUMIF($D$35:$E$66,W3,$R$35:$S$66)>0),SUMIF($D$35:$E$66,W3,$F$35:$G$66)/SUMIF($D$35:$E$66,W3,$H$35:$I$66),0),IF(AND(SUMIF($D$67:$E$82,W3,$H$67:$I$82)>0,SUMIF($D$67:$E$82,W3,$R$67:$S$82)>0),SUMIF($D$67:$E$82,W3,$F$67:$G$82)/SUMIF($D$67:$E$82,W3,$H$67:$I$82),0),IF(AND(SUMIF($D$83:$E$98,W3,$H$83:$I$98)>0,SUMIF($D$83:$E$98,W3,$R$83:$S$98)>0),SUMIF($D$83:$E$98,W3,$F$83:$G$98)/SUMIF($D$83:$E$98,W3,$H$83:$I$98),0),IF(AND(SUMIF($D$99:$E$106,W3,$H$99:$I$106)>0,SUMIF($D$99:$E$106,W3,$R$99:$S$106)>0),SUMIF($D$99:$E$106,W3,$F$99:$G$106)/SUMIF($D$99:$E$106,W3,$H$99:$I$106),0))","v":0},{"$f":"MAX(IF(AND(SUMIF($D$107:$E$114,W3,$H$107:$I$114)>0,SUMIF($D$107:$E$114,W3,$R$107:$S$114)>0),SUMIF($D$107:$E$114,W3,$F$107:$G$114)/SUMIF($D$107:$E$114,W3,$H$107:$I$114),0),IF(AND(SUMIF($D$115:$E$118,W3,$H$115:$I$118)>0,SUMIF($D$115:$E$118,W3,$R$115:$S$118)>0),SUMIF($D$115:$E$118,W3,$F$115:$G$118)/SUMIF($D$115:$E$118,W3,$H$115:$I$118),0),IF(AND(SUMIF($D$119:$E$122,W3,$H$119:$I$122)>0,SUMIF($D$119:$E$122,W3,$R$119:$S$122)>0),SUMIF($D$119:$E$122,W3,$F$119:$G$122)/SUMIF($D$119:$E$122,W3,$H$119:$I$122),0),IF(AND(SUMIF($D$123:$E$124,W3,$H$123:$I$124)>0,SUMIF($D$123:$E$124,W3,$R$123:$S$124)>0),SUMIF($D$123:$E$124,W3,$F$123:$G$124)/SUMIF($D$123:$E$124,W3,$H$123:$I$124),0),IF(AND(SUMIF($D$125:$E$126,W3,$H$125:$I$126)>0,SUMIF($D$125:$E$126,W3,$R$125:$S$126)>0),SUMIF($D$125:$E$126,W3,$F$125:$G$126)/SUMIF($D$125:$E$126,W3,$H$125:$I$126),0))","v":0},{"$f":"MAX(IF(AND(SUMIF($D$127:$E$127,W3,$H$127:$I$127)>0,SUMIF($D$127:$E$127,W3,$R$127:$S$127)>0),SUMIF($D$127:$E$127,W3,$F$127:$G$127)/SUMIF($D$127:$E$127,W3,$H$127:$I$127),0),IF(AND(SUMIF($D$128:$E$128,W3,$H$128:$I$128)>0,SUMIF($D$128:$E$128,W3,$R$128:$S$128)>0),SUMIF($D$128:$E$128,W3,$F$128:$G$128)/SUMIF($D$128:$E$128,W3,$H$128:$I$128),0),IF(AND(SUMIF($D$129:$E$129,W3,$H$129:$I$129)>0,SUMIF($D$129:$E$129,W3,$R$129:$S$129)>0),SUMIF($D$129:$E$129,W3,$F$129:$G$129)/SUMIF($D$129:$E$129,W3,$H$129:$I$129),0))","v":0},null,null,null,{"$f":"IF(T3+U3>0,\"\",L3)","v":0},{"$f":"IF(AND(COUNTIF(L3:L3:$L$129,L3)=1,F3+G3>0),L3 & \"-\",\"\")","v":""},{"$f":"IF(OR(D3=\"Freilos\",E3=\"Freilos\"),1,\"\")","v":""},null,null,{"$f":"IF(AT3>AS3,IF(AND(AR3=\"\",AT3 =\"\"),\"\",AT3-AS3),\"\")","v":""},{"$f":"IF(Auslosung_Turnierdaten!L9=\"\",\"öüä\",Auslosung_Turnierdaten!L9)","v":"öüä"},{"$f":"COUNTIF(L$3:L$129,AV3)-SUMIF(L$3:L$129,AV3,P$3:P$129)","v":0}]
[null,null,2,{"$f":"IF(W19=\"Freilos\",\"Freilos\",IF(W19=\"\",\"Spieler 17\",W19))","v":"Spieler 17"},{"$f":"IF(W51=\"Freilos\",\"Freilos\",IF(W51=\"\",\"Spieler 49\",W51))","v":"Spieler 49"},null,null,null,null,null,null,null,null,0,0,{"$f":"IF(D4=\"Freilos\",0,IF(F4<G4,1,IF(F4>G4,1,0)))","v":0},{"$f":"IF(D4=\"Freilos\",0,IF(F4<G4,1,IF(F4>G4,1,0)))","v":0},{"$f":"IF(D4=\"Freilos\",0,IF(F4>G4,1,0))","v":0},{"$f":"IF(D4=\"Freilos\",0,IF(G4>F4,1,0))","v":0},0,{"$f":"IF(D4=\"Freilos\",3,IF(G4>F4,3,0))","v":0},2,{"$f":"IF(Auslosung_Turnierdaten!F10=\"\",\"Spieler 2\",Auslosung_Turnierdaten!F10)","v":"Spieler 2"},0,0,0,{"$f":"Y4-Z4","v":0},0,{"$f":"SUMIF($D$3:$E$129,W4,$F$3:$G$129)","v":0},{"$f":"AB4-AC4","v":0},{"$f":"IF(AD4>0,AC4/AD4,AC4*1.000000001)","v":0},{"$f":"SUMIF($D$3:$E$129,W4,$H$3:$I$129)","v":0},{"$f":"IF(AF4>0,AC4/AF4,0)","v":0},0,{"$f":"MAX(SUMIF($D$3:$E$34,W4,$J$3:$K$34),SUMIF($D$35:$E$66,W4,$J$35:$K$66),SUMIF($D$67:$E$82,W4,$J$67:$K$82),SUMIF($D$83:$E$98,W4,$J$83:$K$98),SUMIF($D$99:$E$106,W4,$J$99:$K$106),SUMIF($D$107:$E$114,W4,$J$107:$K$114),SUMIF($D$115:$E$118,W4,$J$115:$K$118),SUMIF($D$119:$E$122,W4,$J$119:$K$122),SUMIF($D$123:$E$124,W4,$J$123:$K$124),SUMIF($D$125:$E$126,W4,$J$125:$K$126),SUMIF($D$127:$E$127,W4,$J$127:$K$127),SUMIF($D$128:$E$128,W4,$J$128:$K$128),SUMIF($D$129:$E$129,W4,$J$129:$K$129))","v":0},{"$f":"MAX(IF(AND(SUMIF($D$3:$E$34,W4,$H$3:$I$34)>0,SUMIF($D$3:$E$34,W4,$R$3:$S$34)>0),SUMIF($D$3:$E$34,W4,$F$3:$G$34)/SUMIF($D$3:$E$34,W4,$H$3:$I$34),0),IF(AND(SUMIF($D$35:$E$66,W4,$H$35:$I$66)>0,SUMIF($D$35:$E$66,W4,$R$35:$S$66)>0),SUMIF($D$35:$E$66,W4,$F$35:$G$66)/SUMIF($D$35:$E$66,W4,$H$35:$I$66),0),IF(AND(SUMIF($D$67:$E$82,W4,$H$67:$I$82)>0,SUMIF($D$67:$E$82,W4,$R$67:$S$82)>0),SUMIF($D$67:$E$82,W4,$F$67:$G$82)/SUMIF($D$67:$E$82,W4,$H$67:$I$82),0),IF(AND(SUMIF($D$83:$E$98,W4,$H$83:$I$98)>0,SUMIF($D$83:$E$98,W4,$R$83:$S$98)>0),SUMIF($D$83:$E$98,W4,$F$83:$G$98)/SUMIF($D$83:$E$98,W4,$H$83:$I$98),0),IF(AND(SUMIF($D$99:$E$106,W4,$H$99:$I$106)>0,SUMIF($D$99:$E$106,W4,$R$99:$S$106)>0),SUMIF($D$99:$E$106,W4,$F$99:$G$106)/SUMIF($D$99:$E$106,W4,$H$99:$I$106),0))","v":0},{"$f":"MAX(IF(AND(SUMIF($D$107:$E$114,W4,$H$107:$I$114)>0,SUMIF($D$107:$E$114,W4,$R$107:$S$114)>0),SUMIF($D$107:$E$114,W4,$F$107:$G$114)/SUMIF($D$107:$E$114,W4,$H$107:$I$114),0),IF(AND(SUMIF($D$115:$E$118,W4,$H$115:$I$118)>0,SUMIF($D$115:$E$118,W4,$R$115:$S$118)>0),SUMIF($D$115:$E$118,W4,$F$115:$G$118)/SUMIF($D$115:$E$118,W4,$H$115:$I$118),0),IF(AND(SUMIF($D$119:$E$122,W4,$H$119:$I$122)>0,SUMIF($D$119:$E$122,W4,$R$119:$S$122)>0),SUMIF($D$119:$E$122,W4,$F$119:$G$122)/SUMIF($D$119:$E$122,W4,$H$119:$I$122),0),IF(AND(SUMIF($D$123:$E$124,W4,$H$123:$I$124)>0,SUMIF($D$123:$E$124,W4,$R$123:$S$124)>0),SUMIF($D$123:$E$124,W4,$F$123:$G$124)/SUMIF($D$123:$E$124,W4,$H$123:$I$124),0),IF(AND(SUMIF($D$125:$E$126,W4,$H$125:$I$126)>0,SUMIF($D$125:$E$126,W4,$R$125:$S$126)>0),SUMIF($D$125:$E$126,W4,$F$125:$G$126)/SUMIF($D$125:$E$126,W4,$H$125:$I$126),0))","v":0},{"$f":"MAX(IF(AND(SUMIF($D$127:$E$127,W4,$H$127:$I$127)>0,SUMIF($D$127:$E$127,W4,$R$127:$S$127)>0),SUMIF($D$127:$E$127,W4,$F$127:$G$127)/SUMIF($D$127:$E$127,W4,$H$127:$I$127),0),IF(AND(SUMIF($D$128:$E$128,W4,$H$128:$I$128)>0,SUMIF($D$128:$E$128,W4,$R$128:$S$128)>0),SUMIF($D$128:$E$128,W4,$F$128:$G$128)/SUMIF($D$128:$E$128,W4,$H$128:$I$128),0),IF(AND(SUMIF($D$129:$E$129,W4,$H$129:$I$129)>0,SUMIF($D$129:$E$129,W4,$R$129:$S$129)>0),SUMIF($D$129:$E$129,W4,$F$129:$G$129)/SUMIF($D$129:$E$129,W4,$H$129:$I$129),0))","v":0},null,null,null,{"$f":"IF(T4+U4>0,\"\",L4)","v":0},{"$f":"IF(AND(COUNTIF(L4:L4:$L$129,L4)=1,F4+G4>0),L4 & \"-\",\"\")","v":""},{"$f":"IF(OR(D4=\"Freilos\",E4=\"Freilos\"),1,\"\")","v":""},null,null,{"$f":"IF(AT4>AS4,IF(AND(AR4=\"\",AT4 =\"\"),\"\",AT4-AS4),\"\")","v":""},{"$f":"IF(Auslosung_Turnierdaten!L10=\"\",\"öüä\",Auslosung_Turnierdaten!L10)","v":"öüä"},{"$f":"COUNTIF(L$3:L$129,AV4)-SUMIF(L$3:L$129,AV4,P$3:P$129)","v":0}]
[null,null,3,{"$f":"IF(W11=\"Freilos\",\"Freilos\",IF(W11=\"\",\"Spieler 9\",W11))","v":"Spieler 9"},{"$f":"IF(W43=\"Freilos\",\"Freilos\",IF(W43=\"\",\"Spieler 41\",W43))","v":"Spieler 41"},null,null,null,null,null,null,null,null,0,0,0,0,0,0,0,0,3,{"$f":"IF(Auslosung_Turnierdaten!F11=\"\",\"Spieler 3\",Auslosung_Turnierdaten!F11)","v":"Spieler 3"},0,0,0,0,0,0,0,0,0,0,0,0,0,0,0,null,null,null,0,{"$f":"IF(AND(COUNTIF(L5:L5:$L$129,L5)=1,F5+G5>0),L5 & \"-\",\"\")","v":""},"",null,null,"",{"$f":"IF(Auslosung_Turnierdaten!L11=\"\",\"öüä\",Auslosung_Turnierdaten!L11)","v":"öüä"},0]
[null,null,4,{"$f":"IF(W27=\"Freilos\",\"Freilos\",IF(W27=\"\",\"Spieler 25\",W27))","v":"Spieler 25"},{"$f":"IF(W59=\"Freilos\",\"Freilos\",IF(W59=\"\",\"Spieler 57\",W59))","v":"Spieler 57"},null,null,null,null,null,null,null,null,0,0,0,0,0,0,0,0,4,{"$f":"IF(Auslosung_Turnierdaten!F12=\"\",\"Spieler 4\",Auslosung_Turnierdaten!F12)","v":"Spieler 4"},0,0,0,0,0,0,0,0,0,0,0,0,0,0,0,null,null,null,0,{"$f":"IF(AND(COUNTIF(L6:L6:$L$129,L6)=1,F6+G6>0),L6 & \"-\",\"\")","v":""},"",null,null,"",{"$f":"IF(Auslosung_Turnierdaten!L12=\"\",\"öüä\",Auslosung_Turnierdaten!L12)","v":"öüä"},0]
[null,null,5,{"$f":"IF(W7=\"Freilos\",\"Freilos\",IF(W7=\"\",\"Spieler 5\",W7))","v":"Spieler 5"},{"$f":"IF(W39=\"Freilos\",\"Freilos\",IF(W39=\"\",\"Spieler 37\",W39))","v":"Spieler 37"},null,null,null,null,null,null,null,null,0,0,0,0,0,0,0,0,5,{"$f":"IF(Auslosung_Turnierdaten!F13=\"\",\"Spieler 5\",Auslosung_Turnierdaten!F13)","v":"Spieler 5"},0,0,0,0,0,0,0,0,0,0,0,0,0,0,0,null,null,null,0,{"$f":"IF(AND(COUNTIF(L7:L7:$L$129,L7)=1,F7+G7>0),L7 & \"-\",\"\")","v":""},"",null,null,"",{"$f":"IF(Auslosung_Turnierdaten!L13=\"\",\"öüä\",Auslosung_Turnierdaten!L13)","v":"öüä"},0]
[null,null,6,{"$f":"IF(W23=\"Freilos\",\"Freilos\",IF(W23=\"\",\"Spieler 21\",W23))","v":"Spieler 21"},{"$f":"IF(W55=\"Freilos\",\"Freilos\",IF(W55=\"\",\"Spieler 53\",W55))","v":"Spieler 53"},null,null,null,null,null,null,null,"für Druckoption der Lauf-",0,0,0,0,0,0,0,0,6,{"$f":"IF(Auslosung_Turnierdaten!F14=\"\",\"Spieler 6\",Auslosung_Turnierdaten!F14)","v":"Spieler 6"},0,0,0,0,0,0,0,0,0,0,0,0,0,0,0,null,null,null,0,{"$f":"IF(AND(COUNTIF(L8:L8:$L$129,L8)=1,F8+G8>0),L8 & \"-\",\"\")","v":""},"",null,null,"",{"$f":"IF(Auslosung_Turnierdaten!L14=\"\",\"öüä\",Auslosung_Turnierdaten!L14)","v":"öüä"},0]
{"$rows_left_out":124}
{"sheet":"Viertelfinale","index":3,"n_rows":27,"n_cols":7,"rows_kept":27,"cut":false,"hidden":false,"merged":[[8,1,8,6],[15,1,15,6],[20,1,20,6],[24,1,24,6]]}
[]
[null,null,"Qualifikanten Gewinnerrunde","Qualifikanten Verliererrunde"]
[null,null,{"$f":"'SP64'!D121","v":"Sieger 109"},{"$f":"'SP64'!D119","v":"Sieger 113"}]
[null,null,{"$f":"'SP64'!E121","v":"Sieger 110"},{"$f":"'SP64'!E119","v":"Sieger 114"}]
[null,null,{"$f":"'SP64'!D122","v":"Sieger 111"},{"$f":"'SP64'!D120","v":"Sieger 115"}]
[null,null,{"$f":"'SP64'!E122","v":"Sieger 112"},{"$f":"'SP64'!E120","v":"Sieger 116"}]
[]
[]
{"$rows_left_out":20}
{"sheet":"Baum 64","index":4,"n_rows":65,"n_cols":34,"rows_kept":65,"cut":false,"hidden":true,"merged":[]}
[null,null,null,null,null,null,null,null,null,null,null,null,null,null,null,null,null,null,null,null,null,{"$f":"'SP64'!B3","v":"HR"}]
[null,null,null,null,null,null,null,null,null,null,null,null,null,null,null,null,null,null,{"$f":"'SP64'!B35","v":"VR1"},null,{"$f":"'SP64'!C3","v":1},{"$f":"'SP64'!D3","v":"Spieler 1"},{"$f":"'SP64'!F3","v":0},null,{"$f":"'SP64'!B51","v":"GR1"}]
[null,null,null,null,null,null,null,null,null,null,null,null,null,null,null,null,{"$f":"'SP64'!B67","v":"VR2"},{"$f":"'SP64'!C35","v":33},{"$f":"'SP64'!D35","v":"Verlierer 1"},{"$f":"'SP64'!F35","v":0},null,{"$f":"'SP64'!E3","v":"Spieler 33"},{"$f":"'SP64'!G3","v":0},{"$f":"'SP64'!C51","v":49},{"$f":"'SP64'!D51","v":"Sieger 1"},{"$f":"'SP64'!F51","v":0}]
[null,null,null,null,null,null,null,null,null,null,null,null,null,null,{"$f":"'SP64'!B83","v":"VR3"},{"$f":"'SP64'!C67","v":65},{"$f":"'SP64'!D67","v":"Sieger 33"},{"$f":"'SP64'!F67","v":0},{"$f":"'SP64'!E35","v":"Verlierer 2"},{"$f":"'SP64'!G35","v":0},{"$f":"'SP64'!C4","v":2},{"$f":"'SP64'!D4","v":"Spieler 17"},{"$f":"'SP64'!F4","v":0},null,{"$f":"'SP64'!E51","v":"Sieger 2"},{"$f":"'SP64'!G51","v":0},{"$f":"'SP64'!B91","v":"GR2"}]
[null,null,null,null,null,null,null,null,null,null,null,null,{"$f":"'SP64'!B99","v":"VR4"},{"$f":"'SP64'!C83","v":81},{"$f":"'SP64'!D83","v":"Sieger 65"},{"$f":"'SP64'!F83","v":0},{"$f":"'SP64'!E67","v":"Verlierer 64"},{"$f":"'SP64'!G67","v":0},"Pl. 49-64",null,null,{"$f":"'SP64'!E4","v":"Spieler 49"},{"$f":"'SP64'!G4","v":0},null,"V. nach 80",{"$f":"'SP64'!C91","v":89},{"$f":"'SP64'!D91","v":"Sieger 49"},{"$f":"'SP64'!F91","v":0}]
[null,null,null,null,null,null,null,null,null,null,null,{"$f":"'SP64'!C99","v":97},{"$f":"'SP64'!D99","v":"Sieger 81"},{"$f":"'SP64'!F99","v":0},{"$f":"'SP64'!E83","v":"Sieger 66"},{"$f":"'SP64'!G83","v":0},"Pl. 33-48",null,null,null,{"$f":"'SP64'!C5","v":3},{"$f":"'SP64'!D5","v":"Spieler 9"},{"$f":"'SP64'!F5","v":0},null,null,null,{"$f":"'SP64'!E91","v":"Sieger 50"},{"$f":"'SP64'!G91","v":0}]
[null,null,null,null,null,null,null,null,null,null,null,null,{"$f":"'SP64'!E99","v":"Verlierer 92"},{"$f":"'SP64'!G99","v":0},"Pl. 25-32",null,null,{"$f":"'SP64'!C36","v":34},{"$f":"'SP64'!D36","v":"Verlierer 3"},{"$f":"'SP64'!F36","v":0},null,{"$f":"'SP64'!E5","v":"Spieler 41"},{"$f":"'SP64'!G5","v":0},{"$f":"'SP64'!C52","v":50},{"$f":"'SP64'!D52","v":"Sieger 3"},{"$f":"'SP64'!F52","v":0},"Verlierer nach 100"]
[null,null,null,null,null,null,null,null,null,null,null,null,"Pl. 17-24",null,null,{"$f":"'SP64'!C68","v":66},{"$f":"'SP64'!D68","v":"Sieger 34"},{"$f":"'SP64'!F68","v":0},{"$f":"'SP64'!E36","v":"Verlierer 4"},{"$f":"'SP64'!G36","v":0},{"$f":"'SP64'!C6","v":4},{"$f":"'SP64'!D6","v":"Spieler 25"},{"$f":"'SP64'!F6","v":0},null,{"$f":"'SP64'!E52","v":"Sieger 4"},{"$f":"'SP64'!G52","v":0},null,null,{"$f":"'SP64'!B111","v":"GR3"}]
{"$rows_left_out":58}
{"sheet":"Paarung drucken","index":5,"n_rows":13,"n_cols":8,"rows_kept":13,"cut":false,"hidden":false,"merged":[[1,1,1,7],[8,1,8,3],[8,5,8,7],[9,1,9,3],[2,1,2,7],[3,1,3,7],[6,1,6,2],[6,5,6,6],[13,0,13,8],[9,5,9,7],[10,1,10,3],[10,5,10,7],[12,0,12,8]]}
[]
[null,{"$f":"IF(Auslosung_Turnierdaten!G76=\"\",\"\",Auslosung_Turnierdaten!G76)","v":""}]
[null,{"$f":"IF(Auslosung_Turnierdaten!G78=\"\",\"\",Auslosung_Turnierdaten!G78)","v":""}]
[null,{"$f":"IF(Auslosung_Turnierdaten!G77=\"\",\"\",Auslosung_Turnierdaten!G77)","v":""}]
[]
[]
[null,"Spiel-Nr:",null,126,null,"Tisch:",null,{"$f":"VLOOKUP($D$7,_SP64,10,0)","v":0}]
[]
{"$rows_left_out":6}
{"sheet":"Tabelle","index":6,"n_rows":68,"n_cols":15,"rows_kept":68,"cut":false,"hidden":false,"merged":[]}
[null,null,null,{"$f":"IF(Auslosung_Turnierdaten!G76=\"\",\"\",Auslosung_Turnierdaten!G76) & IF(Auslosung_Turnierdaten!G77=\"\",\"\",\" - \" & Auslosung_Turnierdaten!G77)","v":""}]
[null,null,"PZ",{"$f":"'SP64'!W67","v":"Name, Vorname"},{"$f":"'SP64'!X67","v":"Verein"},{"$f":"'SP64'!Y67","v":"Verein_Nr"},{"$f":"'SP64'!Z67","v":"Lfd_Nr"},{"$f":"'SP64'!AA67","v":"Punkte"},{"$f":"'SP64'!AB67","v":"GP"},{"$f":"'SP64'!AC67","v":"VP"},{"$f":"'SP64'!AD67","v":"GSp"},{"$f":"'SP64'!AE67","v":"VSp"},{"$f":"'SP64'!AF67","v":"Quot"},{"$f":"'SP64'!AG67","v":""},{"$f":"'SP64'!AH67","v":""}]
[null,null,1,"Vor1 Nach2","Verein1",0,111,0,0,0,0,0,0,"",""]
[null,null,2,"Vor2 Nach3","Verein2",0,112,0,0,0,0,0,0,"",""]
[null,null,3,"Vor3 Nach4","Verein3",0,113,0,0,0,0,0,0,"",""]
[null,null,4,"Vor4 Nach5","Verein4",0,114,0,0,0,0,0,0,"",""]
[null,null,5,"Vor5 Nach6","Verein5",0,115,0,0,0,0,0,0,"",""]
[null,null,6,"Vor6 Nach7","Verein6",0,116,0,0,0,0,0,0,"",""]
{"$rows_left_out":61}
{"sheet":"BA-Export","index":7,"n_rows":124,"n_cols":13,"rows_kept":124,"cut":false,"hidden":false,"merged":[]}
[{"$f":"'SP64'!B3","v":"HR"},{"$f":"'SP64'!C3","v":1},{"$f":"IF(('SP64'!D3)=\"Freilos\",0,VLOOKUP('SP64'!D3,'BA-Teilnehmer'!$G$6:$J$69,4,FALSE))","v":{"$error":"#N/A"}},{"$f":"IF(('SP64'!E3)=\"Freilos\",0,VLOOKUP('SP64'!E3,'BA-Teilnehmer'!$G$6:$J$69,4,FALSE))","v":{"$error":"#N/A"}},{"$f":"'SP64'!F3","v":0},{"$f":"'SP64'!G3","v":0},{"$f":"'SP64'!H3","v":0},{"$f":"'SP64'!I3","v":0},{"$f":"'SP64'!J3","v":0},{"$f":"'SP64'!K3","v":0},{"$f":"'SP64'!L3","v":0},{"$f":"'SP64'!AS3","v":"00:00:00"},{"$f":"'SP64'!AT3","v":"00:00:00"}]
[{"$f":"A1","v":"HR"},{"$f":"'SP64'!C4","v":2},{"$f":"IF(('SP64'!D4)=\"Freilos\",0,VLOOKUP('SP64'!D4,'BA-Teilnehmer'!$G$6:$J$69,4,FALSE))","v":{"$error":"#N/A"}},{"$f":"IF(('SP64'!E4)=\"Freilos\",0,VLOOKUP('SP64'!E4,'BA-Teilnehmer'!$G$6:$J$69,4,FALSE))","v":{"$error":"#N/A"}},{"$f":"'SP64'!F4","v":0},{"$f":"'SP64'!G4","v":0},{"$f":"'SP64'!H4","v":0},{"$f":"'SP64'!I4","v":0},{"$f":"'SP64'!J4","v":0},{"$f":"'SP64'!K4","v":0},{"$f":"'SP64'!L4","v":0},{"$f":"'SP64'!AS4","v":"00:00:00"},{"$f":"'SP64'!AT4","v":"00:00:00"}]
[{"$f":"A2","v":"HR"},{"$f":"'SP64'!C5","v":3},{"$f":"IF(('SP64'!D5)=\"Freilos\",0,VLOOKUP('SP64'!D5,'BA-Teilnehmer'!$G$6:$J$69,4,FALSE))","v":{"$error":"#N/A"}},{"$f":"IF(('SP64'!E5)=\"Freilos\",0,VLOOKUP('SP64'!E5,'BA-Teilnehmer'!$G$6:$J$69,4,FALSE))","v":{"$error":"#N/A"}},{"$f":"'SP64'!F5","v":0},{"$f":"'SP64'!G5","v":0},{"$f":"'SP64'!H5","v":0},{"$f":"'SP64'!I5","v":0},{"$f":"'SP64'!J5","v":0},{"$f":"'SP64'!K5","v":0},{"$f":"'SP64'!L5","v":0},{"$f":"'SP64'!AS5","v":"00:00:00"},{"$f":"'SP64'!AT5","v":"00:00:00"}]
["HR",{"$f":"'SP64'!C6","v":4},{"$f":"IF(('SP64'!D6)=\"Freilos\",0,VLOOKUP('SP64'!D6,'BA-Teilnehmer'!$G$6:$J$69,4,FALSE))","v":{"$error":"#N/A"}},{"$f":"IF(('SP64'!E6)=\"Freilos\",0,VLOOKUP('SP64'!E6,'BA-Teilnehmer'!$G$6:$J$69,4,FALSE))","v":{"$error":"#N/A"}},{"$f":"'SP64'!F6","v":0},{"$f":"'SP64'!G6","v":0},{"$f":"'SP64'!H6","v":0},{"$f":"'SP64'!I6","v":0},{"$f":"'SP64'!J6","v":0},{"$f":"'SP64'!K6","v":0},{"$f":"'SP64'!L6","v":0},{"$f":"'SP64'!AS6","v":"00:00:00"},{"$f":"'SP64'!AT6","v":"00:00:00"}]
["HR",{"$f":"'SP64'!C7","v":5},{"$f":"IF(('SP64'!D7)=\"Freilos\",0,VLOOKUP('SP64'!D7,'BA-Teilnehmer'!$G$6:$J$69,4,FALSE))","v":{"$error":"#N/A"}},{"$f":"IF(('SP64'!E7)=\"Freilos\",0,VLOOKUP('SP64'!E7,'BA-Teilnehmer'!$G$6:$J$69,4,FALSE))","v":{"$error":"#N/A"}},{"$f":"'SP64'!F7","v":0},{"$f":"'SP64'!G7","v":0},{"$f":"'SP64'!H7","v":0},{"$f":"'SP64'!I7","v":0},{"$f":"'SP64'!J7","v":0},{"$f":"'SP64'!K7","v":0},{"$f":"'SP64'!L7","v":0},{"$f":"'SP64'!AS7","v":"00:00:00"},{"$f":"'SP64'!AT7","v":"00:00:00"}]
["HR",{"$f":"'SP64'!C8","v":6},{"$f":"IF(('SP64'!D8)=\"Freilos\",0,VLOOKUP('SP64'!D8,'BA-Teilnehmer'!$G$6:$J$69,4,FALSE))","v":{"$error":"#N/A"}},{"$f":"IF(('SP64'!E8)=\"Freilos\",0,VLOOKUP('SP64'!E8,'BA-Teilnehmer'!$G$6:$J$69,4,FALSE))","v":{"$error":"#N/A"}},{"$f":"'SP64'!F8","v":0},{"$f":"'SP64'!G8","v":0},{"$f":"'SP64'!H8","v":0},{"$f":"'SP64'!I8","v":0},{"$f":"'SP64'!J8","v":0},{"$f":"'SP64'!K8","v":0},{"$f":"'SP64'!L8","v":0},{"$f":"'SP64'!AS8","v":"00:00:00"},{"$f":"'SP64'!AT8","v":"00:00:00"}]
["HR",{"$f":"'SP64'!C9","v":7},{"$f":"IF(('SP64'!D9)=\"Freilos\",0,VLOOKUP('SP64'!D9,'BA-Teilnehmer'!$G$6:$J$69,4,FALSE))","v":{"$error":"#N/A"}},{"$f":"IF(('SP64'!E9)=\"Freilos\",0,VLOOKUP('SP64'!E9,'BA-Teilnehmer'!$G$6:$J$69,4,FALSE))","v":{"$error":"#N/A"}},{"$f":"'SP64'!F9","v":0},{"$f":"'SP64'!G9","v":0},{"$f":"'SP64'!H9","v":0},{"$f":"'SP64'!I9","v":0},{"$f":"'SP64'!J9","v":0},{"$f":"'SP64'!K9","v":0},{"$f":"'SP64'!L9","v":0},{"$f":"'SP64'!AS9","v":"00:00:00"},{"$f":"'SP64'!AT9","v":"00:00:00"}]
["HR",{"$f":"'SP64'!C10","v":8},{"$f":"IF(('SP64'!D10)=\"Freilos\",0,VLOOKUP('SP64'!D10,'BA-Teilnehmer'!$G$6:$J$69,4,FALSE))","v":{"$error":"#N/A"}},{"$f":"IF(('SP64'!E10)=\"Freilos\",0,VLOOKUP('SP64'!E10,'BA-Teilnehmer'!$G$6:$J$69,4,FALSE))","v":{"$error":"#N/A"}},{"$f":"'SP64'!F10","v":0},{"$f":"'SP64'!G10","v":0},{"$f":"'SP64'!H10","v":0},{"$f":"'SP64'!I10","v":0},{"$f":"'SP64'!J10","v":0},{"$f":"'SP64'!K10","v":0},{"$f":"'SP64'!L10","v":0},{"$f":"'SP64'!AS10","v":"00:00:00"},{"$f":"'SP64'!AT10","v":"00:00:00"}]
{"$rows_left_out":117}
{"sheet":"Mitglieder","index":8,"n_rows":1632,"n_cols":5,"rows_kept":1632,"cut":false,"hidden":true,"merged":[]}
["Name Vorname","VNR","VNAME","MG_NR","RP"]
["Aigner, Michael",301,"Olimpia München",724,27]
["Al Faraj, Marcel",301,"Olimpia München",689,14]
["Alexus, Petras",301,"Olimpia München",709,""]
["Anzinger, Ronald",301,"Olimpia München",618,28]
["Auer, Dietmar-Lothar",301,"Olimpia München",690,29]
["Bachleitner, Heinz",301,"Olimpia München",691,""]
["Bauereiß, Rüdiger",301,"Olimpia München",564,30]
{"$rows_left_out":1624}