{"text_format":"1","workbook":"xlsx","n_sheets":9,"sheets":["BA-Teilnehmer","Auslosung_Turnierdaten","SP64","Viertelfinale","Baum 64","Paarung drucken","Tabelle","BA-Export","Mitglieder"],"not_rendered":{"charts":0,"images":0,"macros":1,"external_links":1,"defined_names":7,"comments":0,"pivot_tables":0},"unopened":[],"bounds":{"document_bytes":16777216,"sheet_cells":100000,"rows_first":2000,"rows_last":500,"rows_between":2000,"halvings":0,"cell_chars":16384,"cell_head_chars":4096},"cells_cut":0,"cells_raw":0,"read":"whole","date_system":"1900"}

{"sheet":"BA-Teilnehmer","index":0,"n_rows":69,"n_cols":10,"rows_kept":69,"cut":false,"hidden":false,"merged":[[0,1,0,5],[1,1,1,5],[2,1,2,5]]}
[null,"Einloggen - \"Spielbetrieb Verband\" - \"Ergebnisse Turnier\" - Meisterschaft auswählen - \"Spielergebnisse bearbeiten\" -"]
[null,"Teilnehmerliste dann kopieren und in markierten Bereich einfügen - wenn notwendig Verein ergänzen"]
[null,"Schaltfläche \"Spieler in Spielplan übernehmen\" anwählen"]
[]
[null,"Spielernummer","Nachname","Vorname","Verein"]
[1,null,null,null,null,null,{"$f":"IF(C6 & \" \" & D6=\" \",\"\",C6 & \" \" & D6)","v":""},{"$f":"IF(E6=\"\",\"\",E6)","v":""},null,{"$f":"IF(B6=\"\",\"\",B6)","v":""}]
[2,null,null,null,null,null,"","",null,""]
[3,null,null,null,null,null,"","",null,""]
[4,null,null,null,null,null,"","",null,""]
[5,null,null,null,null,null,"","",null,""]
[6,null,null,null,null,null,"","",null,""]
[7,null,null,null,null,null,"","",null,""]
[8,null,null,null,null,null,"","",null,""]
[9,null,null,null,null,null,"","",null,""]
[10,null,null,null,null,null,"","",null,""]
[11,null,null,null,null,null,"","",null,""]
[12,null,null,null,null,null,"","",null,""]
[13,null,null,null,null,null,"","",null,""]
[14,null,null,null,null,null,"","",null,""]
[15,null,null,null,null,null,"","",null,""]
[16,null,null,null,null,null,"","",null,""]
[17,null,null,null,null,null,"","",null,""]
[18,null,null,null,null,null,"","",null,""]
[19,null,null,null,null,null,"","",null,""]
[20,null,null,null,null,null,"","",null,""]
[21,null,null,null,null,null,"","",null,""]
[22,null,null,null,null,null,"","",null,""]
[23,null,null,null,null,null,"","",null,""]
[24,null,null,null,null,null,"","",null,""]
[25,null,null,null,null,null,"","",null,""]
[26,null,null,null,null,null,"","",null,""]
[27,null,null,null,null,null,"","",null,""]
[28,null,null,null,null,null,"","",null,""]
[29,null,null,null,null,null,"","",null,""]
[30,null,null,null,null,null,"","",null,""]
[31,null,null,null,null,null,"","",null,""]
[32,null,null,null,null,null,"","",null,""]
[33,null,null,null,null,null,"","",null,""]
[34,null,null,null,null,null,{"$f":"IF(C39 & \" \" & D39=\" \",\"\",C39 & \" \" & D39)","v":""},{"$f":"IF(E39=\"\",\"\",E39)","v":""},null,{"$f":"IF(B39=\"\",\"\",B39)","v":""}]
[35,null,null,null,null,null,"","",null,""]
[36,null,null,null,null,null,"","",null,""]
[37,null,null,null,null,null,"","",null,""]
[38,null,null,null,null,null,"","",null,""]
[39,null,null,null,null,null,"","",null,""]
[40,null,null,null,null,null,"","",null,""]
[41,null,null,null,null,null,"","",null,""]
[42,null,null,null,null,null,"","",null,""]
[43,null,null,null,null,null,"","",null,""]
[44,null,null,null,null,null,"","",null,""]
[45,null,null,null,null,null,"","",null,""]
[46,null,null,null,null,null,"","",null,""]
[47,null,null,null,null,null,"","",null,""]
[48,null,null,null,null,null,"","",null,""]
[49,null,null,null,null,null,"","",null,""]
[50,null,null,null,null,null,"","",null,""]
[51,null,null,null,null,null,"","",null,""]
[52,null,null,null,null,null,"","",null,""]
[53,null,null,null,null,null,"","",null,""]
[54,null,null,null,null,null,"","",null,""]
[55,null,null,null,null,null,"","",null,""]
[56,null,null,null,null,null,"","",null,""]
[57,null,null,null,null,null,"","",null,""]
[58,null,null,null,null,null,"","",null,""]
[59,null,null,null,null,null,"","",null,""]
[60,null,null,null,null,null,"","",null,""]
[61,null,null,null,null,null,"","",null,""]
[62,null,null,null,null,null,"","",null,""]
[63,null,null,null,null,null,"","",null,""]
[64,null,null,null,null,null,"","",null,""]

{"sheet":"Auslosung_Turnierdaten","index":1,"n_rows":80,"n_cols":22,"rows_kept":80,"cut":false,"hidden":false,"merged":[[7,0,71,0],[7,9,39,9]]}
[]
["Bedienungsanleitung des Spielplans:"]
[]
["Bei Meisterschaften BBV, Verein, Mitliedernummer des Teilnehmers eingeben bzw aus BA-Teilnehmer übernehmen"]
["Eingabe Ergebnisse in SP64"]
["Tabelle siehe Tabelle",null,null,null,null,null,"letzter Stand 25.09.2009"]
[]
["     Achtung doppelte Namenseingabe ! - Achtung doppelte Namenseingabe !",null,null,null,null,"Name, Vorname","Verein","Vereinsnr.","Mg.Nr.","           Achtung doppelte Tischeingabe !","Tischdefinition",null,null,null,"Beginn:",null,{"$f":"COUNTA('SP64'!D3:E34)/2-COUNT('SP64'!AR3:AR34)","v":32},{"$f":"IF(AND(Q8<=$O$11,Q8>0),1,Q8/$O$11)*Auslosung_Turnierdaten!$R$23","v":{"$error":"#DIV/0!"}},"HR",null,{"$f":"MAX(U9:U72)","v":0},{"$f":"MAX(V9:V40)","v":0}]
[null,1,{"$f":"IF(OR(F9=\"\",F9=\"Freilos\"),1.01,RAND())","v":1.01},{"$f":"IF(C9<=1,F9,\"Freilos\")","v":"Freilos"},"d","","",null,"",null,1,null,{"$f":"IF(L9=\"\",\"\",IF(COUNTIF('SP64'!$AP$3:$AP$129,L9)=1,\"\",L9 & \"-\"))","v":""},null,{"$f":"IF(COUNT('SP64'!AS3:AS129)>0,MIN('SP64'!AS3:AS129),0)","v":"00:00:00"},null,{"$f":"COUNTA('SP64'!D35:E66)/2-COUNT('SP64'!AR35:AR66)","v":32},{"$f":"IF(AND(Q9<=$O$11,Q9>0),1,Q9/$O$11)*Auslosung_Turnierdaten!$R$23","v":{"$error":"#DIV/0!"}},"VR1/GR1",null,{"$f":"IF(OR(F9=\"\",F9=\"Freilos\"),0,COUNTIF(F$9:F$72,F9))","v":0},{"$f":"IF(L9=\"\",0,COUNTIF(L$9:L$40,L9))","v":0}]
[null,2,1.01,"Freilos","Marcus Hangöbl","","",null,"",null,2,null,{"$f":"IF(L10=\"\",\"\",IF(COUNTIF('SP64'!$AP$3:$AP$129,L10)=1,\"\",L10 & \"-\"))","v":""},null,"Tischanzahl:",null,{"$f":"COUNTA('SP64'!D67:E82)/2-COUNT('SP64'!AR67:AR82)","v":16},{"$f":"IF(AND(Q10<=$O$11,Q10>0),1,Q10/$O$11)*Auslosung_Turnierdaten!$R$23","v":{"$error":"#DIV/0!"}},"VR2",null,0,{"$f":"IF(L10=\"\",0,COUNTIF(L$9:L$40,L10))","v":0}]
[null,3,1.01,"Freilos","Richard Schermann ","","",null,"",null,3,null,{"$f":"IF(L11=\"\",\"\",IF(COUNTIF('SP64'!$AP$3:$AP$129,L11)=1,\"\",L11 & \"-\"))","v":""},null,{"$f":"IF((COUNTA(L9:L40))>0,(COUNTA(L9:L40)),0)","v":0},null,{"$f":"COUNTA('SP64'!D83:E98)/2-COUNT('SP64'!AR83:AR98)","v":16},{"$f":"IF(AND(Q11<=$O$11,Q11>0),1,Q11/$O$11)*Auslosung_Turnierdaten!$R$23","v":{"$error":"#DIV/0!"}},"GR2/VR3",null,0,0]
[null,4,1.01,"Freilos","Peter Huber","","",null,"",null,4,null,{"$f":"IF(L12=\"\",\"\",IF(COUNTIF('SP64'!$AP$3:$AP$129,L12)=1,\"\",L12 & \"-\"))","v":""},null,"Spiele gesamt:",null,{"$f":"COUNTA('SP64'!D99:E106)/2-COUNT('SP64'!AR99:AR106)","v":8},{"$f":"IF(AND(Q12<=$O$11,Q12>0),1,Q12/$O$11)*Auslosung_Turnierdaten!$R$23","v":{"$error":"#DIV/0!"}},"VR4",null,0,0]
[null,5,1.01,"Freilos","Manfred Kriszt","","",null,"",null,5,null,{"$f":"IF(L13=\"\",\"\",IF(COUNTIF('SP64'!$AP$3:$AP$129,L13)=1,\"\",L13 & \"-\"))","v":""},null,{"$f":"COUNTA('SP64'!D3:E129)/2-COUNT('SP64'!AR3:AR129)","v":127},null,{"$f":"COUNTA('SP64'!D107:E114)/2-COUNT('SP64'!AR107:AR114)","v":8},{"$f":"IF(AND(Q13<=$O$11,Q13>0),1,Q13/$O$11)*Auslosung_Turnierdaten!$R$23","v":{"$error":"#DIV/0!"}},"GR3/VR5",null,0,0]
[null,6,1.01,"Freilos","Florian Gallmaier","","",null,"",null,6,null,{"$f":"IF(L14=\"\",\"\",IF(COUNTIF('SP64'!$AP$3:$AP$129,L14)=1,\"\",L14 & \"-\"))","v":""},null,"? Zeit pro Partie",null,{"$f":"COUNTA('SP64'!D115:E118)/2-COUNT('SP64'!AR115:AR118)","v":4},{"$f":"IF(AND(Q14<=$O$11,Q14>0),1,Q14/$O$11)*Auslosung_Turnierdaten!$R$23","v":{"$error":"#DIV/0!"}},"VR6",null,0,0]
[null,7,1.01,"Freilos","Alex Golsch","","",null,"",null,7,null,{"$f":"IF(L15=\"\",\"\",IF(COUNTIF('SP64'!$AP$3:$AP$129,L15)=1,\"\",L15 & \"-\"))","v":""},null,{"$f":"MAX(R23:R24)","v":"00:00:00"},null,{"$f":"COUNTA('SP64'!D119:E122)/2-COUNT('SP64'!AR119:AR122)","v":4},{"$f":"IF(AND(Q15<=$O$11,Q15>0),1,Q15/$O$11)*Auslosung_Turnierdaten!$R$23","v":{"$error":"#DIV/0!"}},"Gr4/VR7",null,0,0]
[null,8,1.01,"Freilos","Christoph Neumayer","","",null,"",null,8,null,{"$f":"IF(L16=\"\",\"\",IF(COUNTIF('SP64'!$AP$3:$AP$129,L16)=1,\"\",L16 & \"-\"))","v":""},null,"Turnierende ?",null,{"$f":"COUNTA('SP64'!D123:E124)/2-COUNT('SP64'!AR123:AR124)","v":2},{"$f":"IF(AND(Q16<=$O$11,Q16>0),1,Q16/$O$11)*Auslosung_Turnierdaten!$R$23","v":{"$error":"#DIV/0!"}},"VR8",null,0,0]
[null,9,1.01,"Freilos","Mario Geiger","","",null,"",null,9,null,{"$f":"IF(L17=\"\",\"\",IF(COUNTIF('SP64'!$AP$3:$AP$129,L17)=1,\"\",L17 & \"-\"))","v":""},null,{"$f":"IF(O11>0,O9+R21,0)","v":"00:00:00"},null,{"$f":"COUNTA('SP64'!D125:E126)/2-COUNT('SP64'!AR125:AR126)","v":2},{"$f":"IF(AND(Q17<=$O$11,Q17>0),1,Q17/$O$11)*Auslosung_Turnierdaten!$R$23","v":{"$error":"#DIV/0!"}},"Gr5/VR9",null,0,0]
[null,10,1.01,"Freilos","Alfred Weidinger","","",null,"",null,10,null,{"$f":"IF(L18=\"\",\"\",IF(COUNTIF('SP64'!$AP$3:$AP$129,L18)=1,\"\",L18 & \"-\"))","v":""},null,null,null,{"$f":"COUNTA('SP64'!D127:E127)/2-COUNT('SP64'!AR127:AR127)","v":1},{"$f":"IF(AND(Q18<=$O$11,Q18>0),1,Q18/$O$11)*Auslosung_Turnierdaten!$R$23","v":{"$error":"#DIV/0!"}},"VR10",null,0,0]
[null,11,1.01,"Freilos","Stefan Krah","","",null,"",null,11,null,{"$f":"IF(L19=\"\",\"\",IF(COUNTIF('SP64'!$AP$3:$AP$129,L19)=1,\"\",L19 & \"-\"))","v":""},null,null,null,{"$f":"COUNTA('SP64'!D128:E128)/2-COUNT('SP64'!AR128:AR128)","v":1},{"$f":"IF(AND(Q19<=$O$11,Q19>0),1,Q19/$O$11)*Auslosung_Turnierdaten!$R$23","v":{"$error":"#DIV/0!"}},"ER1",null,0,0]
[null,12,1.01,"Freilos","Thomas Ostermeier","","",null,"",null,12,null,{"$f":"IF(L20=\"\",\"\",IF(COUNTIF('SP64'!$AP$3:$AP$129,L20)=1,\"\",L20 & \"-\"))","v":""},null,null,null,{"$f":"COUNTA('SP64'!D129:E129)/2-COUNT('SP64'!AR129:AR129)","v":1},{"$f":"IF(AND(Q20<=$O$11,Q20>0),1,Q20/$O$11)*Auslosung_Turnierdaten!$R$23","v":{"$error":"#DIV/0!"}},"ER2",null,0,0]
[null,13,1.01,"Freilos","Dominik Siegl","","",null,"",null,13,null,{"$f":"IF(L21=\"\",\"\",IF(COUNTIF('SP64'!$AP$3:$AP$129,L21)=1,\"\",L21 & \"-\"))","v":""},null,null,null,{"$f":"SUM(Q8:Q20)","v":127},{"$f":"IF(AND(Q21<=$O$11,Q21>0),1,Q21/$O$11)*Auslosung_Turnierdaten!$R$23","v":{"$error":"#DIV/0!"}},null,null,0,0]
[null,14,1.01,"Freilos","Christian Hütter","","",null,"",null,14,null,{"$f":"IF(L22=\"\",\"\",IF(COUNTIF('SP64'!$AP$3:$AP$129,L22)=1,\"\",L22 & \"-\"))","v":""},null,null,null,null,null,null,null,0,0]
[null,15,1.01,"Freilos","Thomas Krah","","",null,"",null,15,null,{"$f":"IF(L23=\"\",\"\",IF(COUNTIF('SP64'!$AP$3:$AP$129,L23)=1,\"\",L23 & \"-\"))","v":""},null,null,null,null,{"$f":"IF(COUNTIF('SP64'!AU3:AU129,\">0\")>0,SUM('SP64'!AU3:AU129)/COUNTIF('SP64'!AU3:AU129,\">0\"),0)","v":"00:00:00"},null,null,0,0]
[null,16,1.01,"Freilos","Roland Salletmaier","","",null,"",null,16,null,{"$f":"IF(L24=\"\",\"\",IF(COUNTIF('SP64'!$AP$3:$AP$129,L24)=1,\"\",L24 & \"-\"))","v":""},null,null,null,null,{"$f":"IF(SUM('SP64'!F129:G129)>0,(O17-O9)/O13,(O17-O9)/(O13-1))","v":"00:00:00"},null,null,0,0]
[null,17,1.01,"Freilos","Olaf Frauscher","","",null,"",null,17,null,{"$f":"IF(L25=\"\",\"\",IF(COUNTIF('SP64'!$AP$3:$AP$129,L25)=1,\"\",L25 & \"-\"))","v":""},null,null,null,null,null,null,null,0,0]
[null,18,1.01,"Freilos","Stefan Unterhuber","","",null,"",null,18,null,{"$f":"IF(L26=\"\",\"\",IF(COUNTIF('SP64'!$AP$3:$AP$129,L26)=1,\"\",L26 & \"-\"))","v":""},null,null,null,null,null,null,null,0,0]
[null,19,1.01,"Freilos","Sandro Irngartinger","","",null,"",null,19,null,{"$f":"IF(L27=\"\",\"\",IF(COUNTIF('SP64'!$AP$3:$AP$129,L27)=1,\"\",L27 & \"-\"))","v":""},null,null,null,null,null,null,null,0,0]
[null,20,1.01,"Freilos","Wilhelm Georg","","",null,"",null,20,null,{"$f":"IF(L28=\"\",\"\",IF(COUNTIF('SP64'!$AP$3:$AP$129,L28)=1,\"\",L28 & \"-\"))","v":""},null,null,null,null,null,null,null,0,0]
[null,21,1.01,"Freilos","Sebastian Führitz","","",null,"",null,21,null,{"$f":"IF(L29=\"\",\"\",IF(COUNTIF('SP64'!$AP$3:$AP$129,L29)=1,\"\",L29 & \"-\"))","v":""},null,null,null,null,null,null,null,0,0]
[null,22,1.01,"Freilos","Raphael Holzner","","",null,"",null,22,null,{"$f":"IF(L30=\"\",\"\",IF(COUNTIF('SP64'!$AP$3:$AP$129,L30)=1,\"\",L30 & \"-\"))","v":""},null,null,null,null,null,null,null,0,0]
[null,23,1.01,"Freilos","Pete Herman","","",null,"",null,23,null,{"$f":"IF(L31=\"\",\"\",IF(COUNTIF('SP64'!$AP$3:$AP$129,L31)=1,\"\",L31 & \"-\"))","v":""},null,null,null,null,null,null,null,0,0]
[null,24,1.01,"Freilos","Daniel Drexlmeier","","",null,"",null,24,null,{"$f":"IF(L32=\"\",\"\",IF(COUNTIF('SP64'!$AP$3:$AP$129,L32)=1,\"\",L32 & \"-\"))","v":""},null,null,null,null,null,null,null,0,0]
[null,25,1.01,"Freilos","Erwin Konrad","","",null,"",null,25,null,{"$f":"IF(L33=\"\",\"\",IF(COUNTIF('SP64'!$AP$3:$AP$129,L33)=1,\"\",L33 & \"-\"))","v":""},null,null,null,null,null,null,null,0,0]
[null,26,1.01,"Freilos","Thomas Niedermeier","","",null,"",null,26,null,{"$f":"IF(L34=\"\",\"\",IF(COUNTIF('SP64'!$AP$3:$AP$129,L34)=1,\"\",L34 & \"-\"))","v":""},null,null,null,null,null,null,null,0,0]
[null,27,1.01,"Freilos","Habib Alhasbani","","",null,"",null,27,null,{"$f":"IF(L35=\"\",\"\",IF(COUNTIF('SP64'!$AP$3:$AP$129,L35)=1,\"\",L35 & \"-\"))","v":""},null,null,null,null,null,null,null,0,0]
[null,28,1.01,"Freilos","Ahmad Trablssia","","",null,"",null,28,null,{"$f":"IF(L36=\"\",\"\",IF(COUNTIF('SP64'!$AP$3:$AP$129,L36)=1,\"\",L36 & \"-\"))","v":""},null,null,null,null,null,null,null,0,0]
[null,29,1.01,"Freilos","Andreas Starl","","",null,"",null,29,null,{"$f":"IF(L37=\"\",\"\",IF(COUNTIF('SP64'!$AP$3:$AP$129,L37)=1,\"\",L37 & \"-\"))","v":""},null,null,null,null,null,null,null,0,0]
[null,30,1.01,"Freilos","Tobias Hoiß","","",null,"",null,30,null,{"$f":"IF(L38=\"\",\"\",IF(COUNTIF('SP64'!$AP$3:$AP$129,L38)=1,\"\",L38 & \"-\"))","v":""},null,null,null,null,null,null,null,0,0]
[null,31,1.01,"Freilos","Ralf Seeliger","","",null,"",null,31,null,{"$f":"IF(L39=\"\",\"\",IF(COUNTIF('SP64'!$AP$3:$AP$129,L39)=1,\"\",L39 & \"-\"))","v":""},null,null,null,null,null,null,null,0,0]
[null,32,1.01,"Freilos","Bernhard Fimberger","","",null,"",null,32,null,{"$f":"IF(L40=\"\",\"\",IF(COUNTIF('SP64'!$AP$3:$AP$129,L40)=1,\"\",L40 & \"-\"))","v":""},null,null,null,null,null,null,null,0,{"$f":"IF(L40=\"\",0,COUNTIF(L$9:L$40,L40))","v":0}]
[null,33,{"$f":"IF(OR(F41=\"\",F41=\"Freilos\"),1.01,RAND())","v":1.01},{"$f":"IF(C41<=1,F41,\"Freilos\")","v":"Freilos"},"Franz Pichlmeier","","",null,"",null,null,null,null,null,null,null,null,null,null,null,{"$f":"IF(OR(F41=\"\",F41=\"Freilos\"),0,COUNTIF(F$9:F$72,F41))","v":0}]
[null,34,1.01,"Freilos","Elvir Besic","","",null,"",null,null,null,null,null,null,null,null,null,null,null,0]
[null,35,1.01,"Freilos","Dario Gasparovic","","",null,"",null,null,null,null,null,null,null,null,null,null,null,0]
[null,36,1.01,"Freilos","Karl-Heinz Heilmeier","","",null,"",null,null,null,null,null,null,null,null,null,null,null,0]
[null,37,1.01,"Freilos","Günter Schreiner","","",null,"",null,null,null,null,null,null,null,null,null,null,null,0]
[null,38,1.01,"Freilos","Freilos","","",null,"",null,null,null,null,null,null,null,null,null,null,null,0]
[null,39,1.01,"Freilos","Freilos","","",null,"",null,null,null,null,null,null,null,null,null,null,null,0]
[null,40,1.01,"Freilos","Freilos","","",null,"",null,null,null,null,null,null,null,null,null,null,null,0]
[null,41,1.01,"Freilos","Freilos","","",null,"",null,null,null,null,null,null,null,null,null,null,null,0]
[null,42,1.01,"Freilos","Freilos","","",null,"",null,null,null,null,null,null,null,null,null,null,null,0]
[null,43,1.01,"Freilos","Freilos","","",null,"",null,null,null,null,null,null,null,null,null,null,null,0]
[null,44,1.01,"Freilos","Freilos","","",null,"",null,null,null,null,null,null,null,null,null,null,null,0]
[null,45,1.01,"Freilos","Freilos","","",null,"",null,null,null,null,null,null,null,null,null,null,null,0]
[null,46,1.01,"Freilos","Freilos","","",null,"",null,null,null,null,null,null,null,null,null,null,null,0]
[null,47,1.01,"Freilos","Freilos","","",null,"",null,null,null,null,null,null,null,null,null,null,null,0]
[null,48,1.01,"Freilos","Freilos","","",null,"",null,null,null,null,null,null,null,null,null,null,null,0]
[null,49,1.01,"Freilos","Freilos","","",null,"",null,null,null,null,null,null,null,null,null,null,null,0]
[null,50,1.01,"Freilos","Freilos","","",null,"",null,null,null,null,null,null,null,null,null,null,null,0]
[null,51,1.01,"Freilos","Freilos","","",null,"",null,null,null,null,null,null,null,null,null,null,null,0]
[null,52,1.01,"Freilos","Freilos","","",null,"",null,null,null,null,null,null,null,null,null,null,null,0]
[null,53,1.01,"Freilos","Freilos","","",null,"",null,null,null,null,null,null,null,null,null,null,null,0]
[null,54,1.01,"Freilos","Freilos","","",null,"",null,null,null,null,null,null,null,null,null,null,null,0]
[null,55,1.01,"Freilos","Freilos","","",null,"",null,null,null,null,null,null,null,null,null,null,null,0]
[null,56,1.01,"Freilos","Freilos","","",null,"",null,null,null,null,null,null,null,null,null,null,null,0]
[null,57,1.01,"Freilos","Freilos","","",null,"",null,null,null,null,null,null,null,null,null,null,null,0]
[null,58,1.01,"Freilos","Freilos","","",null,"",null,null,null,null,null,null,null,null,null,null,null,0]
[null,59,1.01,"Freilos","Freilos","","",null,"",null,null,null,null,null,null,null,null,null,null,null,0]
[null,60,1.01,"Freilos","Freilos","","",null,"",null,null,null,null,null,null,null,null,null,null,null,0]
[null,61,1.01,"Freilos","Freilos","","",null,"",null,null,null,null,null,null,null,null,null,null,null,0]
[null,62,1.01,"Freilos","Freilos","","",null,"",null,null,null,null,null,null,null,null,null,null,null,0]
[null,63,1.01,"Freilos","Freilos","","",null,"",null,null,null,null,null,null,null,null,null,null,null,0]
[null,64,1.01,"Freilos","Freilos","","",null,"",null,null,null,null,null,null,null,null,null,null,null,0]
[]
[]
[]
[null,null,null,null,null,"Turnierbezeichnung:",null,"Bsp: BM P2 8B Herren"]
[null,null,null,null,null,"Turnierort:"]
[null,null,null,null,null,"Termin:"]
[null,null,null,null,null,"Ausrichtender Verein:"]
[null,null,null,null,null,"Turnierleitung"]

{"sheet":"SP64","index":2,"n_rows":131,"n_cols":49,"rows_kept":131,"cut":false,"hidden":false,"merged":[]}
[null,null,null,null,null,null,null,null,null,null,null,null,{"$f":"\"FT:\"&\" -\"&Auslosung_Turnierdaten!M9&Auslosung_Turnierdaten!M10&Auslosung_Turnierdaten!M11&Auslosung_Turnierdaten!M12&Auslosung_Turnierdaten!M13&Auslosung_Turnierdaten!M14&Auslosung_Turnierdaten!M15&Auslosung_Turnierdaten!M16&Auslosung_Turnierdaten!M17&Auslosung_Turnierdaten!M18&Auslosung_Turnierdaten!M19&Auslosung_Turnierdaten!M20&Auslosung_Turnierdaten!M21&Auslosung_Turnierdaten!M22&Auslosung_Turnierdaten!M23&Auslosung_Turnierdaten!M24&Auslosung_Turnierdaten!M25&Auslosung_Turnierdaten!M26","v":"FT: -"}]
[null,null,null,"Tln1","Tln2","Sp1","Sp2","Auf1","Auf2","HS1","HS2","Tisch",{"$f":"\"-\"&Auslosung_Turnierdaten!M27&Auslosung_Turnierdaten!M28&Auslosung_Turnierdaten!M29&Auslosung_Turnierdaten!M30&Auslosung_Turnierdaten!M31&Auslosung_Turnierdaten!M32&Auslosung_Turnierdaten!M33&Auslosung_Turnierdaten!M34&Auslosung_Turnierdaten!M35&Auslosung_Turnierdaten!M36&Auslosung_Turnierdaten!M37&Auslosung_Turnierdaten!M38&Auslosung_Turnierdaten!M39&Auslosung_Turnierdaten!M40","v":"-"},"Ges","Ges","A1g","A2g","A1+","A2+","P1","P2","Nr","Name","Pkt","P","GP","VP","Spg","GSp","VSp","Quot","Auf","GD","BED","HS","BED-Ber",null,null,null,null,null,null,null,null,"P-Beginn","P-Ende","Dauer",null,{"$f":"MAX(AW3:AW34)","v":0}]
[null,"HR",1,{"$f":"IF(W3=\"Freilos\",\"Freilos\",IF(W3=\"\",\"Spieler 1\",W3))","v":"Spieler 1"},{"$f":"IF(W35=\"Freilos\",\"Freilos\",IF(W35=\"\",\"Spieler 33\",W35))","v":"Spieler 33"},null,null,null,null,null,null,null,null,{"$f":"F3+G3","v":0},{"$f":"N3","v":0},{"$f":"IF(D3=\"Freilos\",0,IF(F3<G3,1,IF(F3>G3,1,0)))","v":0},{"$f":"IF(D3=\"Freilos\",0,IF(F3<G3,1,IF(F3>G3,1,0)))","v":0},{"$f":"IF(D3=\"Freilos\",0,IF(F3>G3,1,0))","v":0},{"$f":"IF(D3=\"Freilos\",0,IF(G3>F3,1,0))","v":0},{"$f":"IF(E3=\"Freilos\",3,IF(F3>G3,3,0))","v":0},{"$f":"IF(D3=\"Freilos\",3,IF(G3>F3,3,0))","v":0},1,{"$f":"IF(Auslosung_Turnierdaten!F9=\"\",\"Spieler 1\",Auslosung_Turnierdaten!F9)","v":"Spieler 1"},{"$f":"IF(W3=\"Freilos\",0,SUMIF($D$3:$E$129,W3,$T$3:$U$129))","v":0},{"$f":"SUMIF($D$3:$E$129,W3,$P$3:$Q$129)","v":0},{"$f":"SUMIF($D$3:$E$129,W3,$R$3:$S$129)","v":0},{"$f":"Y3-Z3","v":0},{"$f":"SUMIF($D$3:$E$129,W3,$N$3:$O$129)","v":0},{"$f":"SUMIF($D$3:$E$129,W3,$F$3:$G$129)","v":0},{"$f":"AB3-AC3","v":0},{"$f":"IF(AD3>0,AC3/AD3,AC3*1.000000001)","v":0},{"$f":"SUMIF($D$3:$E$129,W3,$H$3:$I$129)","v":0},{"$f":"IF(AF3>0,AC3/AF3,0)","v":0},{"$f":"MAX(AJ3:AL3)","v":0},{"$f":"MAX(SUMIF($D$3:$E$34,W3,$J$3:$K$34),SUMIF($D$35:$E$66,W3,$J$35:$K$66),SUMIF($D$67:$E$82,W3,$J$67:$K$82),SUMIF($D$83:$E$98,W3,$J$83:$K$98),SUMIF($D$99:$E$106,W3,$J$99:$K$106),SUMIF($D$107:$E$114,W3,$J$107:$K$114),SUMIF($D$115:$E$118,W3,$J$115:$K$118),SUMIF($D$119:$E$122,W3,$J$119:$K$122),SUMIF($D$123:$E$124,W3,$J$123:$K$124),SUMIF($D$125:$E$126,W3,$J$125:$K$126),SUMIF($D$127:$E$127,W3,$J$127:$K$127),SUMIF($D$128:$E$128,W3,$J$128:$K$128),SUMIF($D$129:$E$129,W3,$J$129:$K$129))","v":0},{"$f":"MAX(IF(AND(SUMIF($D$3:$E$34,W3,$H$3:$I$34)>0,SUMIF($D$3:$E$34,W3,$R$3:$S$34)>0),SUMIF($D$3:$E$34,W3,$F$3:$G$34)/SUMIF($D$3:$E$34,W3,$H$3:$I$34),0),IF(AND(SUMIF($D$35:$E$66,W3,$H$35:$I$66)>0,SUMIF($D$35:$E$66,W3,$R$35:$S$66)>0),SUMIF($D$35:$E$66,W3,$F$35:$G$66)/SUMIF($D$35:$E$66,W3,$H$35:$I$66),0),IF(AND(SUMIF($D$67:$E$82,W3,$H$67:$I$82)>0,SUMIF($D$67:$E$82,W3,$R$67:$S$82)>0),SUMIF($D$67:$E$82,W3,$F$67:$G$82)/SUMIF($D$67:$E$82,W3,$H$67:$I$82),0),IF(AND(SUMIF($D$83:$E$98,W3,$H$83:$I$98)>0,SUMIF($D$83:$E$98,W3,$R$83:$S$98)>0),SUMIF($D$83:$E$98,W3,$F$83:$G$98)/SUMIF($D$83:$E$98,W3,$H$83:$I$98),0),IF(AND(SUMIF($D$99:$E$106,W3,$H$99:$I$106)>0,SUMIF($D$99:$E$106,W3,$R$99:$S$106)>0),SUMIF($D$99:$E$106,W3,$F$99:$G$106)/SUMIF($D$99:$E$106,W3,$H$99:$I$106),0))","v":0},{"$f":"MAX(IF(AND(SUMIF($D$107:$E$114,W3,$H$107:$I$114)>0,SUMIF($D$107:$E$114,W3,$R$107:$S$114)>0),SUMIF($D$107:$E$114,W3,$F$107:$G$114)/SUMIF($D$107:$E$114,W3,$H$107:$I$114),0),IF(AND(SUMIF($D$115:$E$118,W3,$H$115:$I$118)>0,SUMIF($D$115:$E$118,W3,$R$115:$S$118)>0),SUMIF($D$115:$E$118,W3,$F$115:$G$118)/SUMIF($D$115:$E$118,W3,$H$115:$I$118),0),IF(AND(SUMIF($D$119:$E$122,W3,$H$119:$I$122)>0,SUMIF($D$119:$E$122,W3,$R$119:$S$122)>0),SUMIF($D$119:$E$122,W3,$F$119:$G$122)/SUMIF($D$119:$E$122,W3,$H$119:$I$122),0),IF(AND(SUMIF($D$123:$E$124,W3,$H$123:$I$124)>0,SUMIF($D$123:$E$124,W3,$R$123:$S$124)>0),SUMIF($D$123:$E$124,W3,$F$123:$G$124)/SUMIF($D$123:$E$124,W3,$H$123:$I$124),0),IF(AND(SUMIF($D$125:$E$126,W3,$H$125:$I$126)>0,SUMIF($D$125:$E$126,W3,$R$125:$S$126)>0),SUMIF($D$125:$E$126,W3,$F$125:$G$126)/SUMIF($D$125:$E$126,W3,$H$125:$I$126),0))","v":0},{"$f":"MAX(IF(AND(SUMIF($D$127:$E$127,W3,$H$127:$I$127)>0,SUMIF($D$127:$E$127,W3,$R$127:$S$127)>0),SUMIF($D$127:$E$127,W3,$F$127:$G$127)/SUMIF($D$127:$E$127,W3,$H$127:$I$127),0),IF(AND(SUMIF($D$128:$E$128,W3,$H$128:$I$128)>0,SUMIF($D$128:$E$128,W3,$R$128:$S$128)>0),SUMIF($D$128:$E$128,W3,$F$128:$G$128)/SUMIF($D$128:$E$128,W3,$H$128:$I$128),0),IF(AND(SUMIF($D$129:$E$129,W3,$H$129:$I$129)>0,SUMIF($D$129:$E$129,W3,$R$129:$S$129)>0),SUMIF($D$129:$E$129,W3,$F$129:$G$129)/SUMIF($D$129:$E$129,W3,$H$129:$I$129),0))","v":0},null,null,null,{"$f":"IF(T3+U3>0,\"\",L3)","v":0},{"$f":"IF(AND(COUNTIF(L3:L3:$L$129,L3)=1,F3+G3>0),L3 & \"-\",\"\")","v":""},{"$f":"IF(OR(D3=\"Freilos\",E3=\"Freilos\"),1,\"\")","v":""},null,null,{"$f":"IF(AT3>AS3,IF(AND(AR3=\"\",AT3 =\"\"),\"\",AT3-AS3),\"\")","v":""},{"$f":"IF(Auslosung_Turnierdaten!L9=\"\",\"öüä\",Auslosung_Turnierdaten!L9)","v":"öüä"},{"$f":"COUNTIF(L$3:L$129,AV3)-SUMIF(L$3:L$129,AV3,P$3:P$129)","v":0}]
[null,null,2,{"$f":"IF(W19=\"Freilos\",\"Freilos\",IF(W19=\"\",\"Spieler 17\",W19))","v":"Spieler 17"},{"$f":"IF(W51=\"Freilos\",\"Freilos\",IF(W51=\"\",\"Spieler 49\",W51))","v":"Spieler 49"},null,null,null,null,null,null,null,null,0,0,{"$f":"IF(D4=\"Freilos\",0,IF(F4<G4,1,IF(F4>G4,1,0)))","v":0},{"$f":"IF(D4=\"Freilos\",0,IF(F4<G4,1,IF(F4>G4,1,0)))","v":0},{"$f":"IF(D4=\"Freilos\",0,IF(F4>G4,1,0))","v":0},{"$f":"IF(D4=\"Freilos\",0,IF(G4>F4,1,0))","v":0},0,{"$f":"IF(D4=\"Freilos\",3,IF(G4>F4,3,0))","v":0},2,{"$f":"IF(Auslosung_Turnierdaten!F10=\"\",\"Spieler 2\",Auslosung_Turnierdaten!F10)","v":"Spieler 2"},0,0,0,{"$f":"Y4-Z4","v":0},0,{"$f":"SUMIF($D$3:$E$129,W4,$F$3:$G$129)","v":0},{"$f":"AB4-AC4","v":0},{"$f":"IF(AD4>0,AC4/AD4,AC4*1.000000001)","v":0},{"$f":"SUMIF($D$3:$E$129,W4,$H$3:$I$129)","v":0},{"$f":"IF(AF4>0,AC4/AF4,0)","v":0},0,{"$f":"MAX(SUMIF($D$3:$E$34,W4,$J$3:$K$34),SUMIF($D$35:$E$66,W4,$J$35:$K$66),SUMIF($D$67:$E$82,W4,$J$67:$K$82),SUMIF($D$83:$E$98,W4,$J$83:$K$98),SUMIF($D$99:$E$106,W4,$J$99:$K$106),SUMIF($D$107:$E$114,W4,$J$107:$K$114),SUMIF($D$115:$E$118,W4,$J$115:$K$118),SUMIF($D$119:$E$122,W4,$J$119:$K$122),SUMIF($D$123:$E$124,W4,$J$123:$K$124),SUMIF($D$125:$E$126,W4,$J$125:$K$126),SUMIF($D$127:$E$127,W4,$J$127:$K$127),SUMIF($D$128:$E$128,W4,$J$128:$K$128),SUMIF($D$129:$E$129,W4,$J$129:$K$129))","v":0},{"$f":"MAX(IF(AND(SUMIF($D$3:$E$34,W4,$H$3:$I$34)>0,SUMIF($D$3:$E$34,W4,$R$3:$S$34)>0),SUMIF($D$3:$E$34,W4,$F$3:$G$34)/SUMIF($D$3:$E$34,W4,$H$3:$I$34),0),IF(AND(SUMIF($D$35:$E$66,W4,$H$35:$I$66)>0,SUMIF($D$35:$E$66,W4,$R$35:$S$66)>0),SUMIF($D$35:$E$66,W4,$F$35:$G$66)/SUMIF($D$35:$E$66,W4,$H$35:$I$66),0),IF(AND(SUMIF($D$67:$E$82,W4,$H$67:$I$82)>0,SUMIF($D$67:$E$82,W4,$R$67:$S$82)>0),SUMIF($D$67:$E$82,W4,$F$67:$G$82)/SUMIF($D$67:$E$82,W4,$H$67:$I$82),0),IF(AND(SUMIF($D$83:$E$98,W4,$H$83:$I$98)>0,SUMIF($D$83:$E$98,W4,$R$83:$S$98)>0),SUMIF($D$83:$E$98,W4,$F$83:$G$98)/SUMIF($D$83:$E$98,W4,$H$83:$I$98),0),IF(AND(SUMIF($D$99:$E$106,W4,$H$99:$I$106)>0,SUMIF($D$99:$E$106,W4,$R$99:$S$106)>0),SUMIF($D$99:$E$106,W4,$F$99:$G$106)/SUMIF($D$99:$E$106,W4,$H$99:$I$106),0))","v":0},{"$f":"MAX(IF(AND(SUMIF($D$107:$E$114,W4,$H$107:$I$114)>0,SUMIF($D$107:$E$114,W4,$R$107:$S$114)>0),SUMIF($D$107:$E$114,W4,$F$107:$G$114)/SUMIF($D$107:$E$114,W4,$H$107:$I$114),0),IF(AND(SUMIF($D$115:$E$118,W4,$H$115:$I$118)>0,SUMIF($D$115:$E$118,W4,$R$115:$S$118)>0),SUMIF($D$115:$E$118,W4,$F$115:$G$118)/SUMIF($D$115:$E$118,W4,$H$115:$I$118),0),IF(AND(SUMIF($D$119:$E$122,W4,$H$119:$I$122)>0,SUMIF($D$119:$E$122,W4,$R$119:$S$122)>0),SUMIF($D$119:$E$122,W4,$F$119:$G$122)/SUMIF($D$119:$E$122,W4,$H$119:$I$122),0),IF(AND(SUMIF($D$123:$E$124,W4,$H$123:$I$124)>0,SUMIF($D$123:$E$124,W4,$R$123:$S$124)>0),SUMIF($D$123:$E$124,W4,$F$123:$G$124)/SUMIF($D$123:$E$124,W4,$H$123:$I$124),0),IF(AND(SUMIF($D$125:$E$126,W4,$H$125:$I$126)>0,SUMIF($D$125:$E$126,W4,$R$125:$S$126)>0),SUMIF($D$125:$E$126,W4,$F$125:$G$126)/SUMIF($D$125:$E$126,W4,$H$125:$I$126),0))","v":0},{"$f":"MAX(IF(AND(SUMIF($D$127:$E$127,W4,$H$127:$I$127)>0,SUMIF($D$127:$E$127,W4,$R$127:$S$127)>0),SUMIF($D$127:$E$127,W4,$F$127:$G$127)/SUMIF($D$127:$E$127,W4,$H$127:$I$127),0),IF(AND(SUMIF($D$128:$E$128,W4,$H$128:$I$128)>0,SUMIF($D$128:$E$128,W4,$R$128:$S$128)>0),SUMIF($D$128:$E$128,W4,$F$128:$G$128)/SUMIF($D$128:$E$128,W4,$H$128:$I$128),0),IF(AND(SUMIF($D$129:$E$129,W4,$H$129:$I$129)>0,SUMIF($D$129:$E$129,W4,$R$129:$S$129)>0),SUMIF($D$129:$E$129,W4,$F$129:$G$129)/SUMIF($D$129:$E$129,W4,$H$129:$I$129),0))","v":0},null,null,null,{"$f":"IF(T4+U4>0,\"\",L4)","v":0},{"$f":"IF(AND(COUNTIF(L4:L4:$L$129,L4)=1,F4+G4>0),L4 & \"-\",\"\")","v":""},{"$f":"IF(OR(D4=\"Freilos\",E4=\"Freilos\"),1,\"\")","v":""},null,null,{"$f":"IF(AT4>AS4,IF(AND(AR4=\"\",AT4 =\"\"),\"\",AT4-AS4),\"\")","v":""},{"$f":"IF(Auslosung_Turnierdaten!L10=\"\",\"öüä\",Auslosung_Turnierdaten!L10)","v":"öüä"},{"$f":"COUNTIF(L$3:L$129,AV4)-SUMIF(L$3:L$129,AV4,P$3:P$129)","v":0}]
[null,null,3,{"$f":"IF(W11=\"Freilos\",\"Freilos\",IF(W11=\"\",\"Spieler 9\",W11))","v":"Spieler 9"},{"$f":"IF(W43=\"Freilos\",\"Freilos\",IF(W43=\"\",\"Spieler 41\",W43))","v":"Spieler 41"},null,null,null,null,null,null,null,null,0,0,0,0,0,0,0,0,3,{"$f":"IF(Auslosung_Turnierdaten!F11=\"\",\"Spieler 3\",Auslosung_Turnierdaten!F11)","v":"Spieler 3"},0,0,0,0,0,0,0,0,0,0,0,0,0,0,0,null,null,null,0,{"$f":"IF(AND(COUNTIF(L5:L5:$L$129,L5)=1,F5+G5>0),L5 & \"-\",\"\")","v":""},"",null,null,"",{"$f":"IF(Auslosung_Turnierdaten!L11=\"\",\"öüä\",Auslosung_Turnierdaten!L11)","v":"öüä"},0]
[null,null,4,{"$f":"IF(W27=\"Freilos\",\"Freilos\",IF(W27=\"\",\"Spieler 25\",W27))","v":"Spieler 25"},{"$f":"IF(W59=\"Freilos\",\"Freilos\",IF(W59=\"\",\"Spieler 57\",W59))","v":"Spieler 57"},null,null,null,null,null,null,null,null,0,0,0,0,0,0,0,0,4,{"$f":"IF(Auslosung_Turnierdaten!F12=\"\",\"Spieler 4\",Auslosung_Turnierdaten!F12)","v":"Spieler 4"},0,0,0,0,0,0,0,0,0,0,0,0,0,0,0,null,null,null,0,{"$f":"IF(AND(COUNTIF(L6:L6:$L$129,L6)=1,F6+G6>0),L6 & \"-\",\"\")","v":""},"",null,null,"",{"$f":"IF(Auslosung_Turnierdaten!L12=\"\",\"öüä\",Auslosung_Turnierdaten!L12)","v":"öüä"},0]
[null,null,5,{"$f":"IF(W7=\"Freilos\",\"Freilos\",IF(W7=\"\",\"Spieler 5\",W7))","v":"Spieler 5"},{"$f":"IF(W39=\"Freilos\",\"Freilos\",IF(W39=\"\",\"Spieler 37\",W39))","v":"Spieler 37"},null,null,null,null,null,null,null,null,0,0,0,0,0,0,0,0,5,{"$f":"IF(Auslosung_Turnierdaten!F13=\"\",\"Spieler 5\",Auslosung_Turnierdaten!F13)","v":"Spieler 5"},0,0,0,0,0,0,0,0,0,0,0,0,0,0,0,null,null,null,0,{"$f":"IF(AND(COUNTIF(L7:L7:$L$129,L7)=1,F7+G7>0),L7 & \"-\",\"\")","v":""},"",null,null,"",{"$f":"IF(Auslosung_Turnierdaten!L13=\"\",\"öüä\",Auslosung_Turnierdaten!L13)","v":"öüä"},0]
[null,null,6,{"$f":"IF(W23=\"Freilos\",\"Freilos\",IF(W23=\"\",\"Spieler 21\",W23))","v":"Spieler 21"},{"$f":"IF(W55=\"Freilos\",\"Freilos\",IF(W55=\"\",\"Spieler 53\",W55))","v":"Spieler 53"},null,null,null,null,null,null,null,"für Druckoption der Lauf-",0,0,0,0,0,0,0,0,6,{"$f":"IF(Auslosung_Turnierdaten!F14=\"\",\"Spieler 6\",Auslosung_Turnierdaten!F14)","v":"Spieler 6"},0,0,0,0,0,0,0,0,0,0,0,0,0,0,0,null,null,null,0,{"$f":"IF(AND(COUNTIF(L8:L8:$L$129,L8)=1,F8+G8>0),L8 & \"-\",\"\")","v":""},"",null,null,"",{"$f":"IF(Auslosung_Turnierdaten!L14=\"\",\"öüä\",Auslosung_Turnierdaten!L14)","v":"öüä"},0]
[null,null,7,{"$f":"IF(W15=\"Freilos\",\"Freilos\",IF(W15=\"\",\"Spieler 13\",W15))","v":"Spieler 13"},{"$f":"IF(W47=\"Freilos\",\"Freilos\",IF(W47=\"\",\"Spieler 45\",W47))","v":"Spieler 45"},null,null,null,null,null,null,null,"zettel in Leiste rechts",0,0,0,0,0,0,0,0,7,{"$f":"IF(Auslosung_Turnierdaten!F15=\"\",\"Spieler 7\",Auslosung_Turnierdaten!F15)","v":"Spieler 7"},0,0,0,0,0,0,0,0,0,0,0,0,0,0,0,null,null,null,0,{"$f":"IF(AND(COUNTIF(L9:L9:$L$129,L9)=1,F9+G9>0),L9 & \"-\",\"\")","v":""},"",null,null,"",{"$f":"IF(Auslosung_Turnierdaten!L15=\"\",\"öüä\",Auslosung_Turnierdaten!L15)","v":"öüä"},0]
[null,null,8,{"$f":"IF(W31=\"Freilos\",\"Freilos\",IF(W31=\"\",\"Spieler 29\",W31))","v":"Spieler 29"},{"$f":"IF(W63=\"Freilos\",\"Freilos\",IF(W63=\"\",\"Spieler 61\",W63))","v":"Spieler 61"},null,null,null,null,null,null,null,"Partienummer drücken",0,0,0,0,0,0,0,0,8,{"$f":"IF(Auslosung_Turnierdaten!F16=\"\",\"Spieler 8\",Auslosung_Turnierdaten!F16)","v":"Spieler 8"},0,0,0,0,0,0,0,0,0,0,0,0,0,0,0,null,null,null,0,{"$f":"IF(AND(COUNTIF(L10:L10:$L$129,L10)=1,F10+G10>0),L10 & \"-\",\"\")","v":""},"",null,null,"",{"$f":"IF(Auslosung_Turnierdaten!L16=\"\",\"öüä\",Auslosung_Turnierdaten!L16)","v":"öüä"},0]
[null,null,9,{"$f":"IF(W5=\"Freilos\",\"Freilos\",IF(W5=\"\",\"Spieler 3\",W5))","v":"Spieler 3"},{"$f":"IF(W37=\"Freilos\",\"Freilos\",IF(W37=\"\",\"Spieler 35\",W37))","v":"Spieler 35"},null,null,null,null,null,null,null,null,0,0,0,0,0,0,0,0,9,{"$f":"IF(Auslosung_Turnierdaten!F17=\"\",\"Spieler 9\",Auslosung_Turnierdaten!F17)","v":"Spieler 9"},0,0,0,0,0,0,0,0,0,0,0,0,0,0,0,null,null,null,0,{"$f":"IF(AND(COUNTIF(L11:L11:$L$129,L11)=1,F11+G11>0),L11 & \"-\",\"\")","v":""},"",null,null,"",{"$f":"IF(Auslosung_Turnierdaten!L17=\"\",\"öüä\",Auslosung_Turnierdaten!L17)","v":"öüä"},0]
[null,null,10,{"$f":"IF(W21=\"Freilos\",\"Freilos\",IF(W21=\"\",\"Spieler 19\",W21))","v":"Spieler 19"},{"$f":"IF(W53=\"Freilos\",\"Freilos\",IF(W53=\"\",\"Spieler 51\",W53))","v":"Spieler 51"},null,null,null,null,null,null,null,null,0,0,0,0,0,0,0,0,10,{"$f":"IF(Auslosung_Turnierdaten!F18=\"\",\"Spieler 10\",Auslosung_Turnierdaten!F18)","v":"Spieler 10"},0,0,0,0,0,0,0,0,0,0,0,0,0,0,0,null,null,null,0,{"$f":"IF(AND(COUNTIF(L12:L12:$L$129,L12)=1,F12+G12>0),L12 & \"-\",\"\")","v":""},"",null,null,"",{"$f":"IF(Auslosung_Turnierdaten!L18=\"\",\"öüä\",Auslosung_Turnierdaten!L18)","v":"öüä"},0]
[null,null,11,{"$f":"IF(W13=\"Freilos\",\"Freilos\",IF(W13=\"\",\"Spieler 11\",W13))","v":"Spieler 11"},{"$f":"IF(W45=\"Freilos\",\"Freilos\",IF(W45=\"\",\"Spieler 43\",W45))","v":"Spieler 43"},null,null,null,null,null,null,null,null,0,0,0,0,0,0,0,0,11,{"$f":"IF(Auslosung_Turnierdaten!F19=\"\",\"Spieler 11\",Auslosung_Turnierdaten!F19)","v":"Spieler 11"},0,0,0,0,0,0,0,0,0,0,0,0,0,0,0,null,null,null,0,{"$f":"IF(AND(COUNTIF(L13:L13:$L$129,L13)=1,F13+G13>0),L13 & \"-\",\"\")","v":""},"",null,null,"",{"$f":"IF(Auslosung_Turnierdaten!L19=\"\",\"öüä\",Auslosung_Turnierdaten!L19)","v":"öüä"},0]
[null,null,12,{"$f":"IF(W29=\"Freilos\",\"Freilos\",IF(W29=\"\",\"Spieler 27\",W29))","v":"Spieler 27"},{"$f":"IF(W61=\"Freilos\",\"Freilos\",IF(W61=\"\",\"Spieler 59\",W61))","v":"Spieler 59"},null,null,null,null,null,null,null,null,0,0,0,0,0,0,0,0,12,{"$f":"IF(Auslosung_Turnierdaten!F20=\"\",\"Spieler 12\",Auslosung_Turnierdaten!F20)","v":"Spieler 12"},0,0,0,0,0,0,0,0,0,0,0,0,0,0,0,null,null,null,0,{"$f":"IF(AND(COUNTIF(L14:L14:$L$129,L14)=1,F14+G14>0),L14 & \"-\",\"\")","v":""},"",null,null,"",{"$f":"IF(Auslosung_Turnierdaten!L20=\"\",\"öüä\",Auslosung_Turnierdaten!L20)","v":"öüä"},0]
[null,null,13,{"$f":"IF(W9=\"Freilos\",\"Freilos\",IF(W9=\"\",\"Spieler 7\",W9))","v":"Spieler 7"},{"$f":"IF(W41=\"Freilos\",\"Freilos\",IF(W41=\"\",\"Spieler 39\",W41))","v":"Spieler 39"},null,null,null,null,null,null,null,null,0,0,0,0,0,0,0,0,13,{"$f":"IF(Auslosung_Turnierdaten!F21=\"\",\"Spieler 13\",Auslosung_Turnierdaten!F21)","v":"Spieler 13"},0,0,0,0,0,0,0,0,0,0,0,0,0,0,0,null,null,null,0,{"$f":"IF(AND(COUNTIF(L15:L15:$L$129,L15)=1,F15+G15>0),L15 & \"-\",\"\")","v":""},"",null,null,"",{"$f":"IF(Auslosung_Turnierdaten!L21=\"\",\"öüä\",Auslosung_Turnierdaten!L21)","v":"öüä"},0]
[null,null,14,{"$f":"IF(W25=\"Freilos\",\"Freilos\",IF(W25=\"\",\"Spieler 23\",W25))","v":"Spieler 23"},{"$f":"IF(W57=\"Freilos\",\"Freilos\",IF(W57=\"\",\"Spieler 55\",W57))","v":"Spieler 55"},null,null,null,null,null,null,null,null,0,0,0,0,0,0,0,0,14,{"$f":"IF(Auslosung_Turnierdaten!F22=\"\",\"Spieler 14\",Auslosung_Turnierdaten!F22)","v":"Spieler 14"},0,0,0,0,0,0,0,0,0,0,0,0,0,0,0,null,null,null,0,{"$f":"IF(AND(COUNTIF(L16:L16:$L$129,L16)=1,F16+G16>0),L16 & \"-\",\"\")","v":""},"",null,null,"",{"$f":"IF(Auslosung_Turnierdaten!L22=\"\",\"öüä\",Auslosung_Turnierdaten!L22)","v":"öüä"},0]
[null,null,15,{"$f":"IF(W17=\"Freilos\",\"Freilos\",IF(W17=\"\",\"Spieler 15\",W17))","v":"Spieler 15"},{"$f":"IF(W49=\"Freilos\",\"Freilos\",IF(W49=\"\",\"Spieler 47\",W49))","v":"Spieler 47"},null,null,null,null,null,null,null,null,0,0,0,0,0,0,0,0,15,{"$f":"IF(Auslosung_Turnierdaten!F23=\"\",\"Spieler 15\",Auslosung_Turnierdaten!F23)","v":"Spieler 15"},0,0,0,0,0,0,0,0,0,0,0,0,0,0,0,null,null,null,0,{"$f":"IF(AND(COUNTIF(L17:L17:$L$129,L17)=1,F17+G17>0),L17 & \"-\",\"\")","v":""},"",null,null,"",{"$f":"IF(Auslosung_Turnierdaten!L23=\"\",\"öüä\",Auslosung_Turnierdaten!L23)","v":"öüä"},0]
[null,null,16,{"$f":"IF(W33=\"Freilos\",\"Freilos\",IF(W33=\"\",\"Spieler 31\",W33))","v":"Spieler 31"},{"$f":"IF(W65=\"Freilos\",\"Freilos\",IF(W65=\"\",\"Spieler 63\",W65))","v":"Spieler 63"},null,null,null,null,null,null,null,null,0,0,0,0,0,0,0,0,16,{"$f":"IF(Auslosung_Turnierdaten!F24=\"\",\"Spieler 16\",Auslosung_Turnierdaten!F24)","v":"Spieler 16"},0,0,0,0,0,0,0,0,0,0,0,0,0,0,0,null,null,null,0,{"$f":"IF(AND(COUNTIF(L18:L18:$L$129,L18)=1,F18+G18>0),L18 & \"-\",\"\")","v":""},"",null,null,"",{"$f":"IF(Auslosung_Turnierdaten!L24=\"\",\"öüä\",Auslosung_Turnierdaten!L24)","v":"öüä"},0]
[null,null,17,{"$f":"IF(W4=\"Freilos\",\"Freilos\",IF(W4=\"\",\"Spieler 2\",W4))","v":"Spieler 2"},{"$f":"IF(W36=\"Freilos\",\"Freilos\",IF(W36=\"\",\"Spieler 34\",W36))","v":"Spieler 34"},null,null,null,null,null,null,null,null,0,0,0,0,0,0,0,0,17,{"$f":"IF(Auslosung_Turnierdaten!F25=\"\",\"Spieler 17\",Auslosung_Turnierdaten!F25)","v":"Spieler 17"},0,0,0,0,0,0,0,0,0,0,0,0,0,0,0,null,null,null,0,{"$f":"IF(AND(COUNTIF(L19:L19:$L$129,L19)=1,F19+G19>0),L19 & \"-\",\"\")","v":""},"",null,null,"",{"$f":"IF(Auslosung_Turnierdaten!L25=\"\",\"öüä\",Auslosung_Turnierdaten!L25)","v":"öüä"},0]
[null,null,18,{"$f":"IF(W20=\"Freilos\",\"Freilos\",IF(W20=\"\",\"Spieler 18\",W20))","v":"Spieler 18"},{"$f":"IF(W52=\"Freilos\",\"Freilos\",IF(W52=\"\",\"Spieler 50\",W52))","v":"Spieler 50"},null,null,null,null,null,null,null,null,0,0,0,0,0,0,0,0,18,{"$f":"IF(Auslosung_Turnierdaten!F26=\"\",\"Spieler 18\",Auslosung_Turnierdaten!F26)","v":"Spieler 18"},0,0,0,0,0,0,0,0,0,0,0,0,0,0,0,null,null,null,0,{"$f":"IF(AND(COUNTIF(L20:L20:$L$129,L20)=1,F20+G20>0),L20 & \"-\",\"\")","v":""},"",null,null,"",{"$f":"IF(Auslosung_Turnierdaten!L26=\"\",\"öüä\",Auslosung_Turnierdaten!L26)","v":"öüä"},0]
[null,null,19,{"$f":"IF(W12=\"Freilos\",\"Freilos\",IF(W12=\"\",\"Spieler 10\",W12))","v":"Spieler 10"},{"$f":"IF(W44=\"Freilos\",\"Freilos\",IF(W44=\"\",\"Spieler 42\",W44))","v":"Spieler 42"},null,null,null,null,null,null,null,null,0,0,0,0,0,0,0,0,19,{"$f":"IF(Auslosung_Turnierdaten!F27=\"\",\"Spieler 19\",Auslosung_Turnierdaten!F27)","v":"Spieler 19"},0,0,0,0,0,0,0,0,0,0,0,0,0,0,0,null,null,null,0,{"$f":"IF(AND(COUNTIF(L21:L21:$L$129,L21)=1,F21+G21>0),L21 & \"-\",\"\")","v":""},"",null,null,"",{"$f":"IF(Auslosung_Turnierdaten!L27=\"\",\"öüä\",Auslosung_Turnierdaten!L27)","v":"öüä"},0]
[null,null,20,{"$f":"IF(W28=\"Freilos\",\"Freilos\",IF(W28=\"\",\"Spieler 26\",W28))","v":"Spieler 26"},{"$f":"IF(W60=\"Freilos\",\"Freilos\",IF(W60=\"\",\"Spieler 58\",W60))","v":"Spieler 58"},null,null,null,null,null,null,null,null,0,0,0,0,0,0,0,0,20,{"$f":"IF(Auslosung_Turnierdaten!F28=\"\",\"Spieler 20\",Auslosung_Turnierdaten!F28)","v":"Spieler 20"},0,0,0,0,0,0,0,0,0,0,0,0,0,0,0,null,null,null,0,{"$f":"IF(AND(COUNTIF(L22:L22:$L$129,L22)=1,F22+G22>0),L22 & \"-\",\"\")","v":""},"",null,null,"",{"$f":"IF(Auslosung_Turnierdaten!L28=\"\",\"öüä\",Auslosung_Turnierdaten!L28)","v":"öüä"},0]
[null,null,21,{"$f":"IF(W8=\"Freilos\",\"Freilos\",IF(W8=\"\",\"Spieler 6\",W8))","v":"Spieler 6"},{"$f":"IF(W40=\"Freilos\",\"Freilos\",IF(W40=\"\",\"Spieler 38\",W40))","v":"Spieler 38"},null,null,null,null,null,null,null,null,0,0,0,0,0,0,0,0,21,{"$f":"IF(Auslosung_Turnierdaten!F29=\"\",\"Spieler 21\",Auslosung_Turnierdaten!F29)","v":"Spieler 21"},0,0,0,0,0,0,0,0,0,0,0,0,0,0,0,null,null,null,0,{"$f":"IF(AND(COUNTIF(L23:L23:$L$129,L23)=1,F23+G23>0),L23 & \"-\",\"\")","v":""},"",null,null,"",{"$f":"IF(Auslosung_Turnierdaten!L29=\"\",\"öüä\",Auslosung_Turnierdaten!L29)","v":"öüä"},0]
[null,null,22,{"$f":"IF(W24=\"Freilos\",\"Freilos\",IF(W24=\"\",\"Spieler 22\",W24))","v":"Spieler 22"},{"$f":"IF(W56=\"Freilos\",\"Freilos\",IF(W56=\"\",\"Spieler 54\",W56))","v":"Spieler 54"},null,null,null,null,null,null,null,null,0,0,0,0,0,0,0,0,22,{"$f":"IF(Auslosung_Turnierdaten!F30=\"\",\"Spieler 22\",Auslosung_Turnierdaten!F30)","v":"Spieler 22"},0,0,0,0,0,0,0,0,0,0,0,0,0,0,0,null,null,null,0,{"$f":"IF(AND(COUNTIF(L24:L24:$L$129,L24)=1,F24+G24>0),L24 & \"-\",\"\")","v":""},"",null,null,"",{"$f":"IF(Auslosung_Turnierdaten!L30=\"\",\"öüä\",Auslosung_Turnierdaten!L30)","v":"öüä"},0]
[null,null,23,{"$f":"IF(W16=\"Freilos\",\"Freilos\",IF(W16=\"\",\"Spieler 14\",W16))","v":"Spieler 14"},{"$f":"IF(W48=\"Freilos\",\"Freilos\",IF(W48=\"\",\"Spieler 46\",W48))","v":"Spieler 46"},null,null,null,null,null,null,null,null,0,0,0,0,0,0,0,0,23,{"$f":"IF(Auslosung_Turnierdaten!F31=\"\",\"Spieler 23\",Auslosung_Turnierdaten!F31)","v":"Spieler 23"},0,0,0,0,0,0,0,0,0,0,0,0,0,0,0,null,null,null,0,{"$f":"IF(AND(COUNTIF(L25:L25:$L$129,L25)=1,F25+G25>0),L25 & \"-\",\"\")","v":""},"",null,null,"",{"$f":"IF(Auslosung_Turnierdaten!L31=\"\",\"öüä\",Auslosung_Turnierdaten!L31)","v":"öüä"},0]
[null,null,24,{"$f":"IF(W32=\"Freilos\",\"Freilos\",IF(W32=\"\",\"Spieler 30\",W32))","v":"Spieler 30"},{"$f":"IF(W64=\"Freilos\",\"Freilos\",IF(W64=\"\",\"Spieler 62\",W64))","v":"Spieler 62"},null,null,null,null,null,null,null,null,0,0,0,0,0,0,0,0,24,{"$f":"IF(Auslosung_Turnierdaten!F32=\"\",\"Spieler 24\",Auslosung_Turnierdaten!F32)","v":"Spieler 24"},0,0,0,0,0,0,0,0,0,0,0,0,0,0,0,null,null,null,0,{"$f":"IF(AND(COUNTIF(L26:L26:$L$129,L26)=1,F26+G26>0),L26 & \"-\",\"\")","v":""},"",null,null,"",{"$f":"IF(Auslosung_Turnierdaten!L32=\"\",\"öüä\",Auslosung_Turnierdaten!L32)","v":"öüä"},0]
[null,null,25,{"$f":"IF(W6=\"Freilos\",\"Freilos\",IF(W6=\"\",\"Spieler 4\",W6))","v":"Spieler 4"},{"$f":"IF(W38=\"Freilos\",\"Freilos\",IF(W38=\"\",\"Spieler 36\",W38))","v":"Spieler 36"},null,null,null,null,null,null,null,null,0,0,0,0,0,0,0,0,25,{"$f":"IF(Auslosung_Turnierdaten!F33=\"\",\"Spieler 25\",Auslosung_Turnierdaten!F33)","v":"Spieler 25"},0,0,0,0,0,0,0,0,0,0,0,0,0,0,0,null,null,null,0,{"$f":"IF(AND(COUNTIF(L27:L27:$L$129,L27)=1,F27+G27>0),L27 & \"-\",\"\")","v":""},"",null,null,"",{"$f":"IF(Auslosung_Turnierdaten!L33=\"\",\"öüä\",Auslosung_Turnierdaten!L33)","v":"öüä"},0]
[null,null,26,{"$f":"IF(W22=\"Freilos\",\"Freilos\",IF(W22=\"\",\"Spieler 20\",W22))","v":"Spieler 20"},{"$f":"IF(W54=\"Freilos\",\"Freilos\",IF(W54=\"\",\"Spieler 52\",W54))","v":"Spieler 52"},null,null,null,null,null,null,null,null,0,0,0,0,0,0,0,0,26,{"$f":"IF(Auslosung_Turnierdaten!F34=\"\",\"Spieler 26\",Auslosung_Turnierdaten!F34)","v":"Spieler 26"},0,0,0,0,0,0,0,0,0,0,0,0,0,0,0,null,null,null,0,{"$f":"IF(AND(COUNTIF(L28:L28:$L$129,L28)=1,F28+G28>0),L28 & \"-\",\"\")","v":""},"",null,null,"",{"$f":"IF(Auslosung_Turnierdaten!L34=\"\",\"öüä\",Auslosung_Turnierdaten!L34)","v":"öüä"},0]
[null,null,27,{"$f":"IF(W14=\"Freilos\",\"Freilos\",IF(W14=\"\",\"Spieler 12\",W14))","v":"Spieler 12"},{"$f":"IF(W46=\"Freilos\",\"Freilos\",IF(W46=\"\",\"Spieler 44\",W46))","v":"Spieler 44"},null,null,null,null,null,null,null,null,0,0,0,0,0,0,0,0,27,{"$f":"IF(Auslosung_Turnierdaten!F35=\"\",\"Spieler 27\",Auslosung_Turnierdaten!F35)","v":"Spieler 27"},0,0,0,0,0,0,0,0,0,0,0,0,0,0,0,null,null,null,0,{"$f":"IF(AND(COUNTIF(L29:L29:$L$129,L29)=1,F29+G29>0),L29 & \"-\",\"\")","v":""},"",null,null,"",{"$f":"IF(Auslosung_Turnierdaten!L35=\"\",\"öüä\",Auslosung_Turnierdaten!L35)","v":"öüä"},0]
[null,null,28,{"$f":"IF(W30=\"Freilos\",\"Freilos\",IF(W30=\"\",\"Spieler 28\",W30))","v":"Spieler 28"},{"$f":"IF(W62=\"Freilos\",\"Freilos\",IF(W62=\"\",\"Spieler 60\",W62))","v":"Spieler 60"},null,null,null,null,null,null,null,null,0,0,0,0,0,0,0,0,28,{"$f":"IF(Auslosung_Turnierdaten!F36=\"\",\"Spieler 28\",Auslosung_Turnierdaten!F36)","v":"Spieler 28"},0,0,0,0,0,0,0,0,0,0,0,0,0,0,0,null,null,null,0,{"$f":"IF(AND(COUNTIF(L30:L30:$L$129,L30)=1,F30+G30>0),L30 & \"-\",\"\")","v":""},"",null,null,"",{"$f":"IF(Auslosung_Turnierdaten!L36=\"\",\"öüä\",Auslosung_Turnierdaten!L36)","v":"öüä"},0]
[null,null,29,{"$f":"IF(W10=\"Freilos\",\"Freilos\",IF(W10=\"\",\"Spieler 8\",W10))","v":"Spieler 8"},{"$f":"IF(W42=\"Freilos\",\"Freilos\",IF(W42=\"\",\"Spieler 40\",W42))","v":"Spieler 40"},null,null,null,null,null,null,null,null,0,0,0,0,0,0,0,0,29,{"$f":"IF(Auslosung_Turnierdaten!F37=\"\",\"Spieler 29\",Auslosung_Turnierdaten!F37)","v":"Spieler 29"},0,0,0,0,0,0,0,0,0,0,0,0,0,0,0,null,null,null,0,{"$f":"IF(AND(COUNTIF(L31:L31:$L$129,L31)=1,F31+G31>0),L31 & \"-\",\"\")","v":""},"",null,null,"",{"$f":"IF(Auslosung_Turnierdaten!L37=\"\",\"öüä\",Auslosung_Turnierdaten!L37)","v":"öüä"},0]
[null,null,30,{"$f":"IF(W26=\"Freilos\",\"Freilos\",IF(W26=\"\",\"Spieler 24\",W26))","v":"Spieler 24"},{"$f":"IF(W58=\"Freilos\",\"Freilos\",IF(W58=\"\",\"Spieler 56\",W58))","v":"Spieler 56"},null,null,null,null,null,null,null,null,0,0,0,0,0,0,0,0,30,{"$f":"IF(Auslosung_Turnierdaten!F38=\"\",\"Spieler 30\",Auslosung_Turnierdaten!F38)","v":"Spieler 30"},0,0,0,0,0,0,0,0,0,0,0,0,0,0,0,null,null,null,0,{"$f":"IF(AND(COUNTIF(L32:L32:$L$129,L32)=1,F32+G32>0),L32 & \"-\",\"\")","v":""},"",null,null,"",{"$f":"IF(Auslosung_Turnierdaten!L38=\"\",\"öüä\",Auslosung_Turnierdaten!L38)","v":"öüä"},0]
[null,null,31,{"$f":"IF(W18=\"Freilos\",\"Freilos\",IF(W18=\"\",\"Spieler 16\",W18))","v":"Spieler 16"},{"$f":"IF(W50=\"Freilos\",\"Freilos\",IF(W50=\"\",\"Spieler 48\",W50))","v":"Spieler 48"},null,null,null,null,null,null,null,null,0,0,0,0,0,0,0,0,31,{"$f":"IF(Auslosung_Turnierdaten!F39=\"\",\"Spieler 31\",Auslosung_Turnierdaten!F39)","v":"Spieler 31"},0,0,0,0,0,0,0,0,0,0,0,0,0,0,0,null,null,null,0,{"$f":"IF(AND(COUNTIF(L33:L33:$L$129,L33)=1,F33+G33>0),L33 & \"-\",\"\")","v":""},"",null,null,"",{"$f":"IF(Auslosung_Turnierdaten!L39=\"\",\"öüä\",Auslosung_Turnierdaten!L39)","v":"öüä"},0]
[null,null,32,{"$f":"IF(W34=\"Freilos\",\"Freilos\",IF(W34=\"\",\"Spieler 32\",W34))","v":"Spieler 32"},{"$f":"IF(W66=\"Freilos\",\"Freilos\",IF(W66=\"\",\"Spieler 64\",W66))","v":"Spieler 64"},null,null,null,null,null,null,null,null,0,0,0,0,0,0,0,0,32,{"$f":"IF(Auslosung_Turnierdaten!F40=\"\",\"Spieler 32\",Auslosung_Turnierdaten!F40)","v":"Spieler 32"},0,0,0,0,0,0,0,0,0,0,0,0,0,0,0,null,null,null,0,{"$f":"IF(AND(COUNTIF(L34:L34:$L$129,L34)=1,F34+G34>0),L34 & \"-\",\"\")","v":""},"",null,null,"",{"$f":"IF(Auslosung_Turnierdaten!L40=\"\",\"öüä\",Auslosung_Turnierdaten!L40)","v":"öüä"},0]
[null,"VR1",33,{"$f":"IF(D3=\"Spieler 1\",\"Verlierer 1\",IF(E3=\"Spieler 33\",\"Verlierer 1\",IF(D3=E3,\"Freilos\",IF(E3=\"Freilos\",E3,IF(D3=\"Freilos\",D3,IF(F3>G3,E3,IF(G3>F3,D3,\"Verlierer 1\")))))))","v":"Verlierer 1"},{"$f":"IF(D4=\"Spieler 17\",\"Verlierer 2\",IF(E4=\"Spieler 49\",\"Verlierer 2\",IF(D4=E4,\"Freilos\",IF(E4=\"Freilos\",E4,IF(D4=\"Freilos\",D4,IF(F4>G4,E4,IF(G4>F4,D4,\"Verlierer 2\")))))))","v":"Verlierer 2"},null,null,null,null,null,null,null,{"$f":"IF(F35>G35,E35,IF(G35>F35,D35,\"\"))","v":""},0,0,0,0,0,0,0,0,33,{"$f":"IF(Auslosung_Turnierdaten!F41=\"\",\"Spieler 33\",Auslosung_Turnierdaten!F41)","v":"Spieler 33"},{"$f":"IF(W35=\"Freilos\",0,SUMIF($D$3:$E$129,W35,$T$3:$U$129))","v":0},{"$f":"SUMIF($D$3:$E$129,W35,$P$3:$Q$129)","v":0},{"$f":"SUMIF($D$3:$E$129,W35,$R$3:$S$129)","v":0},0,{"$f":"SUMIF($D$3:$E$129,W35,$N$3:$O$129)","v":0},0,0,0,0,0,{"$f":"MAX(AJ35:AL35)","v":0},0,0,0,0,null,null,null,0,{"$f":"IF(AND(COUNTIF(L35:L35:$L$129,L35)=1,F35+G35>0),L35 & \"-\",\"\")","v":""},"",null,null,""]
[null,null,34,{"$f":"IF(D5=\"Spieler 9\",\"Verlierer 3\",IF(E5=\"Spieler 41\",\"Verlierer 3\",IF(D5=E5,\"Freilos\",IF(E5=\"Freilos\",E5,IF(D5=\"Freilos\",D5,IF(F5>G5,E5,IF(G5>F5,D5,\"Verlierer 3\")))))))","v":"Verlierer 3"},{"$f":"IF(D6=\"Spieler 25\",\"Verlierer 4\",IF(E6=\"Spieler 57\",\"Verlierer 4\",IF(D6=E6,\"Freilos\",IF(E6=\"Freilos\",E6,IF(D6=\"Freilos\",D6,IF(F6>G6,E6,IF(G6>F6,D6,\"Verlierer 4\")))))))","v":"Verlierer 4"},null,null,null,null,null,null,null,"",0,0,0,0,0,0,0,0,34,{"$f":"IF(Auslosung_Turnierdaten!F42=\"\",\"Spieler 34\",Auslosung_Turnierdaten!F42)","v":"Spieler 34"},0,0,0,0,0,0,0,0,0,0,0,0,0,0,0,null,null,null,0,{"$f":"IF(AND(COUNTIF(L36:L36:$L$129,L36)=1,F36+G36>0),L36 & \"-\",\"\")","v":""},"",null,null,""]
[null,null,35,{"$f":"IF(D7=\"Spieler 5\",\"Verlierer 5\",IF(E7=\"Spieler 37\",\"Verlierer 5\",IF(D7=E7,\"Freilos\",IF(E7=\"Freilos\",E7,IF(D7=\"Freilos\",D7,IF(F7>G7,E7,IF(G7>F7,D7,\"Verlierer 5\")))))))","v":"Verlierer 5"},{"$f":"IF(D8=\"Spieler 21\",\"Verlierer 6\",IF(E8=\"Spieler 53\",\"Verlierer 6\",IF(D8=E8,\"Freilos\",IF(E8=\"Freilos\",E8,IF(D8=\"Freilos\",D8,IF(F8>G8,E8,IF(G8>F8,D8,\"Verlierer 6\")))))))","v":"Verlierer 6"},null,null,null,null,null,null,null,"",0,0,0,0,0,0,0,0,35,{"$f":"IF(Auslosung_Turnierdaten!F43=\"\",\"Spieler 35\",Auslosung_Turnierdaten!F43)","v":"Spieler 35"},0,0,0,0,0,0,0,0,0,0,0,0,0,0,0,null,null,null,0,{"$f":"IF(AND(COUNTIF(L37:L37:$L$129,L37)=1,F37+G37>0),L37 & \"-\",\"\")","v":""},"",null,null,""]
[null,null,36,{"$f":"IF(D9=\"Spieler 13\",\"Verlierer 7\",IF(E9=\"Spieler 45\",\"Verlierer 7\",IF(D9=E9,\"Freilos\",IF(E9=\"Freilos\",E9,IF(D9=\"Freilos\",D9,IF(F9>G9,E9,IF(G9>F9,D9,\"Verlierer 7\")))))))","v":"Verlierer 7"},{"$f":"IF(D10=\"Spieler 29\",\"Verlierer 8\",IF(E10=\"Spieler 61\",\"Verlierer 8\",IF(D10=E10,\"Freilos\",IF(E10=\"Freilos\",E10,IF(D10=\"Freilos\",D10,IF(F10>G10,E10,IF(G10>F10,D10,\"Verlierer 8\")))))))","v":"Verlierer 8"},null,null,null,null,null,null,null,"",0,0,0,0,0,0,0,0,36,{"$f":"IF(Auslosung_Turnierdaten!F44=\"\",\"Spieler 36\",Auslosung_Turnierdaten!F44)","v":"Spieler 36"},0,0,0,0,0,0,0,0,0,0,0,0,0,0,0,null,null,null,0,{"$f":"IF(AND(COUNTIF(L38:L38:$L$129,L38)=1,F38+G38>0),L38 & \"-\",\"\")","v":""},"",null,null,""]
[null,null,37,{"$f":"IF(D11=\"Spieler 3\",\"Verlierer 9\",IF(E11=\"Spieler 35\",\"Verlierer 9\",IF(D11=E11,\"Freilos\",IF(E11=\"Freilos\",E11,IF(D11=\"Freilos\",D11,IF(F11>G11,E11,IF(G11>F11,D11,\"Verlierer 9\")))))))","v":"Verlierer 9"},{"$f":"IF(D12=\"Spieler 19\",\"Verlierer 10\",IF(E12=\"Spieler 51\",\"Verlierer 10\",IF(D12=E12,\"Freilos\",IF(E12=\"Freilos\",E12,IF(D12=\"Freilos\",D12,IF(F12>G12,E12,IF(G12>F12,D12,\"Verlierer 10\")))))))","v":"Verlierer 10"},null,null,null,null,null,null,null,"",0,0,0,0,0,0,0,0,37,{"$f":"IF(Auslosung_Turnierdaten!F45=\"\",\"Spieler 37\",Auslosung_Turnierdaten!F45)","v":"Spieler 37"},0,0,0,0,0,0,0,0,0,0,0,0,0,0,0,null,null,null,0,{"$f":"IF(AND(COUNTIF(L39:L39:$L$129,L39)=1,F39+G39>0),L39 & \"-\",\"\")","v":""},"",null,null,""]
[null,null,38,{"$f":"IF(D13=\"Spieler 11\",\"Verlierer 11\",IF(E13=\"Spieler 43\",\"Verlierer 11\",IF(D13=E13,\"Freilos\",IF(E13=\"Freilos\",E13,IF(D13=\"Freilos\",D13,IF(F13>G13,E13,IF(G13>F13,D13,\"Verlierer 11\")))))))","v":"Verlierer 11"},{"$f":"IF(D14=\"Spieler 27\",\"Verlierer 12\",IF(E14=\"Spieler 59\",\"Verlierer 12\",IF(D14=E14,\"Freilos\",IF(E14=\"Freilos\",E14,IF(D14=\"Freilos\",D14,IF(F14>G14,E14,IF(G14>F14,D14,\"Verlierer 12\")))))))","v":"Verlierer 12"},null,null,null,null,null,null,null,"",0,0,0,0,0,0,0,0,38,{"$f":"IF(Auslosung_Turnierdaten!F46=\"\",\"Spieler 38\",Auslosung_Turnierdaten!F46)","v":"Spieler 38"},0,0,0,0,0,0,0,0,0,0,0,0,0,0,0,null,null,null,0,{"$f":"IF(AND(COUNTIF(L40:L40:$L$129,L40)=1,F40+G40>0),L40 & \"-\",\"\")","v":""},"",null,null,""]
[null,null,39,{"$f":"IF(D15=\"Spieler 7\",\"Verlierer 13\",IF(E15=\"Spieler 39\",\"Verlierer 13\",IF(D15=E15,\"Freilos\",IF(E15=\"Freilos\",E15,IF(D15=\"Freilos\",D15,IF(F15>G15,E15,IF(G15>F15,D15,\"Verlierer 13\")))))))","v":"Verlierer 13"},{"$f":"IF(D16=\"Spieler 23\",\"Verlierer 14\",IF(E16=\"Spieler 55\",\"Verlierer 14\",IF(D16=E16,\"Freilos\",IF(E16=\"Freilos\",E16,IF(D16=\"Freilos\",D16,IF(F16>G16,E16,IF(G16>F16,D16,\"Verlierer 14\")))))))","v":"Verlierer 14"},null,null,null,null,null,null,null,"",0,0,0,0,0,0,0,0,39,{"$f":"IF(Auslosung_Turnierdaten!F47=\"\",\"Spieler 39\",Auslosung_Turnierdaten!F47)","v":"Spieler 39"},0,0,0,0,0,0,0,0,0,0,0,0,0,0,0,null,null,null,0,{"$f":"IF(AND(COUNTIF(L41:L41:$L$129,L41)=1,F41+G41>0),L41 & \"-\",\"\")","v":""},"",null,null,""]
[null,null,40,{"$f":"IF(D17=\"Spieler 15\",\"Verlierer 15\",IF(E17=\"Spieler 47\",\"Verlierer 15\",IF(D17=E17,\"Freilos\",IF(E17=\"Freilos\",E17,IF(D17=\"Freilos\",D17,IF(F17>G17,E17,IF(G17>F17,D17,\"Verlierer 15\")))))))","v":"Verlierer 15"},{"$f":"IF(D18=\"Spieler 31\",\"Verlierer 16\",IF(E18=\"Spieler 63\",\"Verlierer 16\",IF(D18=E18,\"Freilos\",IF(E18=\"Freilos\",E18,IF(D18=\"Freilos\",D18,IF(F18>G18,E18,IF(G18>F18,D18,\"Verlierer 16\")))))))","v":"Verlierer 16"},null,null,null,null,null,null,null,"",0,0,0,0,0,0,0,0,40,{"$f":"IF(Auslosung_Turnierdaten!F48=\"\",\"Spieler 40\",Auslosung_Turnierdaten!F48)","v":"Spieler 40"},0,0,0,0,0,0,0,0,0,0,0,0,0,0,0,null,null,null,0,{"$f":"IF(AND(COUNTIF(L42:L42:$L$129,L42)=1,F42+G42>0),L42 & \"-\",\"\")","v":""},"",null,null,""]
[null,null,41,{"$f":"IF(D19=\"Spieler 2\",\"Verlierer 17\",IF(E19=\"Spieler 34\",\"Verlierer 17\",IF(D19=E19,\"Freilos\",IF(E19=\"Freilos\",E19,IF(D19=\"Freilos\",D19,IF(F19>G19,E19,IF(G19>F19,D19,\"Verlierer 17\")))))))","v":"Verlierer 17"},{"$f":"IF(D20=\"Spieler 18\",\"Verlierer 18\",IF(E20=\"Spieler 50\",\"Verlierer 18\",IF(D20=E20,\"Freilos\",IF(E20=\"Freilos\",E20,IF(D20=\"Freilos\",D20,IF(F20>G20,E20,IF(G20>F20,D20,\"Verlierer 18\")))))))","v":"Verlierer 18"},null,null,null,null,null,null,null,"",0,0,0,0,0,0,0,0,41,{"$f":"IF(Auslosung_Turnierdaten!F49=\"\",\"Spieler 41\",Auslosung_Turnierdaten!F49)","v":"Spieler 41"},0,0,0,0,0,0,0,0,0,0,0,0,0,0,0,null,null,null,0,{"$f":"IF(AND(COUNTIF(L43:L43:$L$129,L43)=1,F43+G43>0),L43 & \"-\",\"\")","v":""},"",null,null,""]
[null,null,42,{"$f":"IF(D21=\"Spieler 10\",\"Verlierer 19\",IF(E21=\"Spieler 42\",\"Verlierer 19\",IF(D21=E21,\"Freilos\",IF(E21=\"Freilos\",E21,IF(D21=\"Freilos\",D21,IF(F21>G21,E21,IF(G21>F21,D21,\"Verlierer 19\")))))))","v":"Verlierer 19"},{"$f":"IF(D22=\"Spieler 26\",\"Verlierer 20\",IF(E22=\"Spieler 58\",\"Verlierer 20\",IF(D22=E22,\"Freilos\",IF(E22=\"Freilos\",E22,IF(D22=\"Freilos\",D22,IF(F22>G22,E22,IF(G22>F22,D22,\"Verlierer 20\")))))))","v":"Verlierer 20"},null,null,null,null,null,null,null,"",0,0,0,0,0,0,0,0,42,{"$f":"IF(Auslosung_Turnierdaten!F50=\"\",\"Spieler 42\",Auslosung_Turnierdaten!F50)","v":"Spieler 42"},0,0,0,0,0,0,0,0,0,0,0,0,0,0,0,null,null,null,0,{"$f":"IF(AND(COUNTIF(L44:L44:$L$129,L44)=1,F44+G44>0),L44 & \"-\",\"\")","v":""},"",null,null,""]
[null,null,43,{"$f":"IF(D23=\"Spieler 6\",\"Verlierer 21\",IF(E23=\"Spieler 38\",\"Verlierer 21\",IF(D23=E23,\"Freilos\",IF(E23=\"Freilos\",E23,IF(D23=\"Freilos\",D23,IF(F23>G23,E23,IF(G23>F23,D23,\"Verlierer 21\")))))))","v":"Verlierer 21"},{"$f":"IF(D24=\"Spieler 22\",\"Verlierer 22\",IF(E24=\"Spieler 54\",\"Verlierer 22\",IF(D24=E24,\"Freilos\",IF(E24=\"Freilos\",E24,IF(D24=\"Freilos\",D24,IF(F24>G24,E24,IF(G24>F24,D24,\"Verlierer 22\")))))))","v":"Verlierer 22"},null,null,null,null,null,null,null,"",0,0,0,0,0,0,0,0,43,{"$f":"IF(Auslosung_Turnierdaten!F51=\"\",\"Spieler 43\",Auslosung_Turnierdaten!F51)","v":"Spieler 43"},0,0,0,0,0,0,0,0,0,0,0,0,0,0,0,null,null,null,0,{"$f":"IF(AND(COUNTIF(L45:L45:$L$129,L45)=1,F45+G45>0),L45 & \"-\",\"\")","v":""},"",null,null,""]
[null,null,44,{"$f":"IF(D25=\"Spieler 14\",\"Verlierer 23\",IF(E25=\"Spieler 46\",\"Verlierer 23\",IF(D25=E25,\"Freilos\",IF(E25=\"Freilos\",E25,IF(D25=\"Freilos\",D25,IF(F25>G25,E25,IF(G25>F25,D25,\"Verlierer 23\")))))))","v":"Verlierer 23"},{"$f":"IF(D26=\"Spieler 30\",\"Verlierer 24\",IF(E26=\"Spieler 62\",\"Verlierer 24\",IF(D26=E26,\"Freilos\",IF(E26=\"Freilos\",E26,IF(D26=\"Freilos\",D26,IF(F26>G26,E26,IF(G26>F26,D26,\"Verlierer 24\")))))))","v":"Verlierer 24"},null,null,null,null,null,null,null,"",0,0,0,0,0,0,0,0,44,{"$f":"IF(Auslosung_Turnierdaten!F52=\"\",\"Spieler 44\",Auslosung_Turnierdaten!F52)","v":"Spieler 44"},0,0,0,0,0,0,0,0,0,0,0,0,0,0,0,null,null,null,0,{"$f":"IF(AND(COUNTIF(L46:L46:$L$129,L46)=1,F46+G46>0),L46 & \"-\",\"\")","v":""},"",null,null,""]
[null,null,45,{"$f":"IF(D27=\"Spieler 4\",\"Verlierer 25\",IF(E27=\"Spieler 36\",\"Verlierer 25\",IF(D27=E27,\"Freilos\",IF(E27=\"Freilos\",E27,IF(D27=\"Freilos\",D27,IF(F27>G27,E27,IF(G27>F27,D27,\"Verlierer 25\")))))))","v":"Verlierer 25"},{"$f":"IF(D28=\"Spieler 20\",\"Verlierer 26\",IF(E28=\"Spieler 52\",\"Verlierer 26\",IF(D28=E28,\"Freilos\",IF(E28=\"Freilos\",E28,IF(D28=\"Freilos\",D28,IF(F28>G28,E28,IF(G28>F28,D28,\"Verlierer 26\")))))))","v":"Verlierer 26"},null,null,null,null,null,null,null,"",0,0,0,0,0,0,0,0,45,{"$f":"IF(Auslosung_Turnierdaten!F53=\"\",\"Spieler 45\",Auslosung_Turnierdaten!F53)","v":"Spieler 45"},0,0,0,0,0,0,0,0,0,0,0,0,0,0,0,null,null,null,0,{"$f":"IF(AND(COUNTIF(L47:L47:$L$129,L47)=1,F47+G47>0),L47 & \"-\",\"\")","v":""},"",null,null,""]
[null,null,46,{"$f":"IF(D29=\"Spieler 12\",\"Verlierer 27\",IF(E29=\"Spieler 44\",\"Verlierer 27\",IF(D29=E29,\"Freilos\",IF(E29=\"Freilos\",E29,IF(D29=\"Freilos\",D29,IF(F29>G29,E29,IF(G29>F29,D29,\"Verlierer 27\")))))))","v":"Verlierer 27"},{"$f":"IF(D30=\"Spieler 28\",\"Verlierer 28\",IF(E30=\"Spieler 60\",\"Verlierer 28\",IF(D30=E30,\"Freilos\",IF(E30=\"Freilos\",E30,IF(D30=\"Freilos\",D30,IF(F30>G30,E30,IF(G30>F30,D30,\"Verlierer 28\")))))))","v":"Verlierer 28"},null,null,null,null,null,null,null,"",0,0,0,0,0,0,0,0,46,{"$f":"IF(Auslosung_Turnierdaten!F54=\"\",\"Spieler 46\",Auslosung_Turnierdaten!F54)","v":"Spieler 46"},0,0,0,0,0,0,0,0,0,0,0,0,0,0,0,null,null,null,0,{"$f":"IF(AND(COUNTIF(L48:L48:$L$129,L48)=1,F48+G48>0),L48 & \"-\",\"\")","v":""},"",null,null,""]
[null,null,47,{"$f":"IF(D31=\"Spieler 8\",\"Verlierer 29\",IF(E31=\"Spieler 40\",\"Verlierer 29\",IF(D31=E31,\"Freilos\",IF(E31=\"Freilos\",E31,IF(D31=\"Freilos\",D31,IF(F31>G31,E31,IF(G31>F31,D31,\"Verlierer 29\")))))))","v":"Verlierer 29"},{"$f":"IF(D32=\"Spieler 24\",\"Verlierer 30\",IF(E32=\"Spieler 56\",\"Verlierer 30\",IF(D32=E32,\"Freilos\",IF(E32=\"Freilos\",E32,IF(D32=\"Freilos\",D32,IF(F32>G32,E32,IF(G32>F32,D32,\"Verlierer 30\")))))))","v":"Verlierer 30"},null,null,null,null,null,null,null,"",0,0,0,0,0,0,0,0,47,{"$f":"IF(Auslosung_Turnierdaten!F55=\"\",\"Spieler 47\",Auslosung_Turnierdaten!F55)","v":"Spieler 47"},0,0,0,0,0,0,0,0,0,0,0,0,0,0,0,null,null,null,0,{"$f":"IF(AND(COUNTIF(L49:L49:$L$129,L49)=1,F49+G49>0),L49 & \"-\",\"\")","v":""},"",null,null,""]
[null,null,48,{"$f":"IF(D33=\"Spieler 16\",\"Verlierer 31\",IF(E33=\"Spieler 48\",\"Verlierer 31\",IF(D33=E33,\"Freilos\",IF(E33=\"Freilos\",E33,IF(D33=\"Freilos\",D33,IF(F33>G33,E33,IF(G33>F33,D33,\"Verlierer 31\")))))))","v":"Verlierer 31"},{"$f":"IF(D34=\"Spieler 32\",\"Verlierer 32\",IF(E34=\"Spieler 64\",\"Verlierer 32\",IF(D34=E34,\"Freilos\",IF(E34=\"Freilos\",E34,IF(D34=\"Freilos\",D34,IF(F34>G34,E34,IF(G34>F34,D34,\"Verlierer 32\")))))))","v":"Verlierer 32"},null,null,null,null,null,null,null,"",0,0,0,0,0,0,0,0,48,{"$f":"IF(Auslosung_Turnierdaten!F56=\"\",\"Spieler 48\",Auslosung_Turnierdaten!F56)","v":"Spieler 48"},0,0,0,0,0,0,0,0,0,0,0,0,0,0,0,null,null,null,0,{"$f":"IF(AND(COUNTIF(L50:L50:$L$129,L50)=1,F50+G50>0),L50 & \"-\",\"\")","v":""},"",null,null,""]
[null,"GR1",49,{"$f":"IF(D3=\"Spieler 1\",\"Sieger 1\",IF(E3=\"Spieler 33\",\"Sieger 1\",IF(D3=E3,\"Freilos\",IF(E3=\"Freilos\",D3,IF(D3=\"Freilos\",E3,IF(F3>G3,D3,IF(G3>F3,E3,\"Sieger 1\")))))))","v":"Sieger 1"},{"$f":"IF(D4=\"Spieler 17\",\"Sieger 2\",IF(E4=\"Spieler 49\",\"Sieger 2\",IF(D4=E4,\"Freilos\",IF(E4=\"Freilos\",D4,IF(D4=\"Freilos\",E4,IF(F4>G4,D4,IF(G4>F4,E4,\"Sieger 2\")))))))","v":"Sieger 2"},null,null,null,null,null,null,null,null,0,0,0,0,0,0,{"$f":"IF(E51=\"Freilos\",6,IF(F51>G51,6,0))","v":0},{"$f":"IF(D51=\"Freilos\",6,IF(G51>F51,6,0))","v":0},49,{"$f":"IF(Auslosung_Turnierdaten!F57=\"\",\"Spieler 49\",Auslosung_Turnierdaten!F57)","v":"Spieler 49"},0,0,0,0,0,0,0,0,0,0,0,0,0,0,0,null,null,null,0,{"$f":"IF(AND(COUNTIF(L51:L51:$L$129,L51)=1,F51+G51>0),L51 & \"-\",\"\")","v":""},"",null,null,""]
[null,null,50,{"$f":"IF(D5=\"Spieler 9\",\"Sieger 3\",IF(E5=\"Spieler 41\",\"Sieger 3\",IF(D5=E5,\"Freilos\",IF(E5=\"Freilos\",D5,IF(D5=\"Freilos\",E5,IF(F5>G5,D5,IF(G5>F5,E5,\"Sieger 3\")))))))","v":"Sieger 3"},{"$f":"IF(D6=\"Spieler 25\",\"Sieger 4\",IF(E6=\"Spieler 57\",\"Sieger 4\",IF(D6=E6,\"Freilos\",IF(E6=\"Freilos\",D6,IF(D6=\"Freilos\",E6,IF(F6>G6,D6,IF(G6>F6,E6,\"Sieger 4\")))))))","v":"Sieger 4"},null,null,null,null,null,null,null,null,0,0,0,0,0,0,0,0,50,{"$f":"IF(Auslosung_Turnierdaten!F58=\"\",\"Spieler 50\",Auslosung_Turnierdaten!F58)","v":"Spieler 50"},0,0,0,0,0,0,0,0,0,0,0,0,0,0,0,null,null,null,0,{"$f":"IF(AND(COUNTIF(L52:L52:$L$129,L52)=1,F52+G52>0),L52 & \"-\",\"\")","v":""},"",null,null,""]
[null,null,51,{"$f":"IF(D7=\"Spieler 5\",\"Sieger 5\",IF(E7=\"Spieler 37\",\"Sieger 5\",IF(D7=E7,\"Freilos\",IF(E7=\"Freilos\",D7,IF(D7=\"Freilos\",E7,IF(F7>G7,D7,IF(G7>F7,E7,\"Sieger 5\")))))))","v":"Sieger 5"},{"$f":"IF(D8=\"Spieler 21\",\"Sieger 6\",IF(E8=\"Spieler 53\",\"Sieger 6\",IF(D8=E8,\"Freilos\",IF(E8=\"Freilos\",D8,IF(D8=\"Freilos\",E8,IF(F8>G8,D8,IF(G8>F8,E8,\"Sieger 6\")))))))","v":"Sieger 6"},null,null,null,null,null,null,null,null,0,0,0,0,0,0,0,0,51,{"$f":"IF(Auslosung_Turnierdaten!F59=\"\",\"Spieler 51\",Auslosung_Turnierdaten!F59)","v":"Spieler 51"},0,0,0,0,0,0,0,0,0,0,0,0,0,0,0,null,null,null,0,{"$f":"IF(AND(COUNTIF(L53:L53:$L$129,L53)=1,F53+G53>0),L53 & \"-\",\"\")","v":""},"",null,null,""]
[null,null,52,{"$f":"IF(D9=\"Spieler 13\",\"Sieger 7\",IF(E9=\"Spieler 45\",\"Sieger 7\",IF(D9=E9,\"Freilos\",IF(E9=\"Freilos\",D9,IF(D9=\"Freilos\",E9,IF(F9>G9,D9,IF(G9>F9,E9,\"Sieger 7\")))))))","v":"Sieger 7"},{"$f":"IF(D10=\"Spieler 29\",\"Sieger 8\",IF(E10=\"Spieler 61\",\"Sieger 8\",IF(D10=E10,\"Freilos\",IF(E10=\"Freilos\",D10,IF(D10=\"Freilos\",E10,IF(F10>G10,D10,IF(G10>F10,E10,\"Sieger 8\")))))))","v":"Sieger 8"},null,null,null,null,null,null,null,null,0,0,0,0,0,0,0,0,52,{"$f":"IF(Auslosung_Turnierdaten!F60=\"\",\"Spieler 52\",Auslosung_Turnierdaten!F60)","v":"Spieler 52"},0,0,0,0,0,0,0,0,0,0,0,0,0,0,0,null,null,null,0,{"$f":"IF(AND(COUNTIF(L54:L54:$L$129,L54)=1,F54+G54>0),L54 & \"-\",\"\")","v":""},"",null,null,""]
[null,null,53,{"$f":"IF(D11=\"Spieler 3\",\"Sieger 9\",IF(E11=\"Spieler 35\",\"Sieger 9\",IF(D11=E11,\"Freilos\",IF(E11=\"Freilos\",D11,IF(D11=\"Freilos\",E11,IF(F11>G11,D11,IF(G11>F11,E11,\"Sieger 9\")))))))","v":"Sieger 9"},{"$f":"IF(D12=\"Spieler 19\",\"Sieger 10\",IF(E12=\"Spieler 51\",\"Sieger 10\",IF(D12=E12,\"Freilos\",IF(E12=\"Freilos\",D12,IF(D12=\"Freilos\",E12,IF(F12>G12,D12,IF(G12>F12,E12,\"Sieger 10\")))))))","v":"Sieger 10"},null,null,null,null,null,null,null,null,0,0,0,0,0,0,0,0,53,{"$f":"IF(Auslosung_Turnierdaten!F61=\"\",\"Spieler 53\",Auslosung_Turnierdaten!F61)","v":"Spieler 53"},0,0,0,0,0,0,0,0,0,0,0,0,0,0,0,null,null,null,0,{"$f":"IF(AND(COUNTIF(L55:L55:$L$129,L55)=1,F55+G55>0),L55 & \"-\",\"\")","v":""},"",null,null,""]
[null,null,54,{"$f":"IF(D13=\"Spieler 11\",\"Sieger 11\",IF(E13=\"Spieler 43\",\"Sieger 11\",IF(D13=E13,\"Freilos\",IF(E13=\"Freilos\",D13,IF(D13=\"Freilos\",E13,IF(F13>G13,D13,IF(G13>F13,E13,\"Sieger 11\")))))))","v":"Sieger 11"},{"$f":"IF(D14=\"Spieler 27\",\"Sieger 12\",IF(E14=\"Spieler 59\",\"Sieger 12\",IF(D14=E14,\"Freilos\",IF(E14=\"Freilos\",D14,IF(D14=\"Freilos\",E14,IF(F14>G14,D14,IF(G14>F14,E14,\"Sieger 12\")))))))","v":"Sieger 12"},null,null,null,null,null,null,null,null,0,0,0,0,0,0,0,0,54,{"$f":"IF(Auslosung_Turnierdaten!F62=\"\",\"Spieler 54\",Auslosung_Turnierdaten!F62)","v":"Spieler 54"},0,0,0,0,0,0,0,0,0,0,0,0,0,0,0,null,null,null,0,{"$f":"IF(AND(COUNTIF(L56:L56:$L$129,L56)=1,F56+G56>0),L56 & \"-\",\"\")","v":""},"",null,null,""]
[null,null,55,{"$f":"IF(D15=\"Spieler 7\",\"Sieger 13\",IF(E15=\"Spieler 39\",\"Sieger 13\",IF(D15=E15,\"Freilos\",IF(E15=\"Freilos\",D15,IF(D15=\"Freilos\",E15,IF(F15>G15,D15,IF(G15>F15,E15,\"Sieger 13\")))))))","v":"Sieger 13"},{"$f":"IF(D16=\"Spieler 23\",\"Sieger 14\",IF(E16=\"Spieler 55\",\"Sieger 14\",IF(D16=E16,\"Freilos\",IF(E16=\"Freilos\",D16,IF(D16=\"Freilos\",E16,IF(F16>G16,D16,IF(G16>F16,E16,\"Sieger 14\")))))))","v":"Sieger 14"},null,null,null,null,null,null,null,null,0,0,0,0,0,0,0,0,55,{"$f":"IF(Auslosung_Turnierdaten!F63=\"\",\"Spieler 55\",Auslosung_Turnierdaten!F63)","v":"Spieler 55"},0,0,0,0,0,0,0,0,0,0,0,0,0,0,0,null,null,null,0,{"$f":"IF(AND(COUNTIF(L57:L57:$L$129,L57)=1,F57+G57>0),L57 & \"-\",\"\")","v":""},"",null,null,""]
[null,null,56,{"$f":"IF(D17=\"Spieler 15\",\"Sieger 15\",IF(E17=\"Spieler 47\",\"Sieger 15\",IF(D17=E17,\"Freilos\",IF(E17=\"Freilos\",D17,IF(D17=\"Freilos\",E17,IF(F17>G17,D17,IF(G17>F17,E17,\"Sieger 15\")))))))","v":"Sieger 15"},{"$f":"IF(D18=\"Spieler 31\",\"Sieger 16\",IF(E18=\"Spieler 63\",\"Sieger 16\",IF(D18=E18,\"Freilos\",IF(E18=\"Freilos\",D18,IF(D18=\"Freilos\",E18,IF(F18>G18,D18,IF(G18>F18,E18,\"Sieger 16\")))))))","v":"Sieger 16"},null,null,null,null,null,null,null,null,0,0,0,0,0,0,0,0,56,{"$f":"IF(Auslosung_Turnierdaten!F64=\"\",\"Spieler 56\",Auslosung_Turnierdaten!F64)","v":"Spieler 56"},0,0,0,0,0,0,0,0,0,0,0,0,0,0,0,null,null,null,0,{"$f":"IF(AND(COUNTIF(L58:L58:$L$129,L58)=1,F58+G58>0),L58 & \"-\",\"\")","v":""},"",null,null,""]
[null,null,57,{"$f":"IF(D19=\"Spieler 2\",\"Sieger 17\",IF(E19=\"Spieler 34\",\"Sieger 17\",IF(D19=E19,\"Freilos\",IF(E19=\"Freilos\",D19,IF(D19=\"Freilos\",E19,IF(F19>G19,D19,IF(G19>F19,E19,\"Sieger 17\")))))))","v":"Sieger 17"},{"$f":"IF(D20=\"Spieler 18\",\"Sieger 18\",IF(E20=\"Spieler 50\",\"Sieger 18\",IF(D20=E20,\"Freilos\",IF(E20=\"Freilos\",D20,IF(D20=\"Freilos\",E20,IF(F20>G20,D20,IF(G20>F20,E20,\"Sieger 18\")))))))","v":"Sieger 18"},null,null,null,null,null,null,null,null,0,0,0,0,0,0,0,0,57,{"$f":"IF(Auslosung_Turnierdaten!F65=\"\",\"Spieler 57\",Auslosung_Turnierdaten!F65)","v":"Spieler 57"},0,0,0,0,0,0,0,0,0,0,0,0,0,0,0,null,null,null,0,{"$f":"IF(AND(COUNTIF(L59:L59:$L$129,L59)=1,F59+G59>0),L59 & \"-\",\"\")","v":""},"",null,null,""]
[null,null,58,{"$f":"IF(D21=\"Spieler 10\",\"Sieger 19\",IF(E21=\"Spieler 42\",\"Sieger 19\",IF(D21=E21,\"Freilos\",IF(E21=\"Freilos\",D21,IF(D21=\"Freilos\",E21,IF(F21>G21,D21,IF(G21>F21,E21,\"Sieger 19\")))))))","v":"Sieger 19"},{"$f":"IF(D22=\"Spieler 26\",\"Sieger 20\",IF(E22=\"Spieler 58\",\"Sieger 20\",IF(D22=E22,\"Freilos\",IF(E22=\"Freilos\",D22,IF(D22=\"Freilos\",E22,IF(F22>G22,D22,IF(G22>F22,E22,\"Sieger 20\")))))))","v":"Sieger 20"},null,null,null,null,null,null,null,null,0,0,0,0,0,0,0,0,58,{"$f":"IF(Auslosung_Turnierdaten!F66=\"\",\"Spieler 58\",Auslosung_Turnierdaten!F66)","v":"Spieler 58"},0,0,0,0,0,0,0,0,0,0,0,0,0,0,0,null,null,null,0,{"$f":"IF(AND(COUNTIF(L60:L60:$L$129,L60)=1,F60+G60>0),L60 & \"-\",\"\")","v":""},"",null,null,""]
[null,null,59,{"$f":"IF(D23=\"Spieler 6\",\"Sieger 21\",IF(E23=\"Spieler 38\",\"Sieger 21\",IF(D23=E23,\"Freilos\",IF(E23=\"Freilos\",D23,IF(D23=\"Freilos\",E23,IF(F23>G23,D23,IF(G23>F23,E23,\"Sieger 21\")))))))","v":"Sieger 21"},{"$f":"IF(D24=\"Spieler 22\",\"Sieger 22\",IF(E24=\"Spieler 54\",\"Sieger 22\",IF(D24=E24,\"Freilos\",IF(E24=\"Freilos\",D24,IF(D24=\"Freilos\",E24,IF(F24>G24,D24,IF(G24>F24,E24,\"Sieger 22\")))))))","v":"Sieger 22"},null,null,null,null,null,null,null,null,0,0,0,0,0,0,0,0,59,{"$f":"IF(Auslosung_Turnierdaten!F67=\"\",\"Spieler 59\",Auslosung_Turnierdaten!F67)","v":"Spieler 59"},0,0,0,0,0,0,0,0,0,0,0,0,0,0,0,null,null,null,0,{"$f":"IF(AND(COUNTIF(L61:L61:$L$129,L61)=1,F61+G61>0),L61 & \"-\",\"\")","v":""},"",null,null,""]
[null,null,60,{"$f":"IF(D25=\"Spieler 14\",\"Sieger 23\",IF(E25=\"Spieler 46\",\"Sieger 23\",IF(D25=E25,\"Freilos\",IF(E25=\"Freilos\",D25,IF(D25=\"Freilos\",E25,IF(F25>G25,D25,IF(G25>F25,E25,\"Sieger 23\")))))))","v":"Sieger 23"},{"$f":"IF(D26=\"Spieler 30\",\"Sieger 24\",IF(E26=\"Spieler 62\",\"Sieger 24\",IF(D26=E26,\"Freilos\",IF(E26=\"Freilos\",D26,IF(D26=\"Freilos\",E26,IF(F26>G26,D26,IF(G26>F26,E26,\"Sieger 24\")))))))","v":"Sieger 24"},null,null,null,null,null,null,null,null,0,0,0,0,0,0,0,0,60,{"$f":"IF(Auslosung_Turnierdaten!F68=\"\",\"Spieler 60\",Auslosung_Turnierdaten!F68)","v":"Spieler 60"},0,0,0,0,0,0,0,0,0,0,0,0,0,0,0,null,null,null,0,{"$f":"IF(AND(COUNTIF(L62:L62:$L$129,L62)=1,F62+G62>0),L62 & \"-\",\"\")","v":""},"",null,null,""]
[null,null,61,{"$f":"IF(D27=\"Spieler 4\",\"Sieger 25\",IF(E27=\"Spieler 36\",\"Sieger 25\",IF(D27=E27,\"Freilos\",IF(E27=\"Freilos\",D27,IF(D27=\"Freilos\",E27,IF(F27>G27,D27,IF(G27>F27,E27,\"Sieger 25\")))))))","v":"Sieger 25"},{"$f":"IF(D28=\"Spieler 20\",\"Sieger 26\",IF(E28=\"Spieler 52\",\"Sieger 26\",IF(D28=E28,\"Freilos\",IF(E28=\"Freilos\",D28,IF(D28=\"Freilos\",E28,IF(F28>G28,D28,IF(G28>F28,E28,\"Sieger 26\")))))))","v":"Sieger 26"},null,null,null,null,null,null,null,null,0,0,0,0,0,0,0,0,61,{"$f":"IF(Auslosung_Turnierdaten!F69=\"\",\"Spieler 61\",Auslosung_Turnierdaten!F69)","v":"Spieler 61"},0,0,0,0,0,0,0,0,0,0,0,0,0,0,0,null,null,null,0,{"$f":"IF(AND(COUNTIF(L63:L63:$L$129,L63)=1,F63+G63>0),L63 & \"-\",\"\")","v":""},"",null,null,""]
[null,null,62,{"$f":"IF(D29=\"Spieler 12\",\"Sieger 27\",IF(E29=\"Spieler 44\",\"Sieger 27\",IF(D29=E29,\"Freilos\",IF(E29=\"Freilos\",D29,IF(D29=\"Freilos\",E29,IF(F29>G29,D29,IF(G29>F29,E29,\"Sieger 27\")))))))","v":"Sieger 27"},{"$f":"IF(D30=\"Spieler 28\",\"Sieger 28\",IF(E30=\"Spieler 60\",\"Sieger 28\",IF(D30=E30,\"Freilos\",IF(E30=\"Freilos\",D30,IF(D30=\"Freilos\",E36,IF(F30>G30,D30,IF(G30>F30,E30,\"Sieger 28\")))))))","v":"Sieger 28"},null,null,null,null,null,null,null,null,0,0,0,0,0,0,0,0,62,{"$f":"IF(Auslosung_Turnierdaten!F70=\"\",\"Spieler 62\",Auslosung_Turnierdaten!F70)","v":"Spieler 62"},0,0,0,0,0,0,0,0,0,0,0,0,0,0,0,null,null,null,0,{"$f":"IF(AND(COUNTIF(L64:L64:$L$129,L64)=1,F64+G64>0),L64 & \"-\",\"\")","v":""},"",null,null,""]
[null,null,63,{"$f":"IF(D31=\"Spieler 8\",\"Sieger 29\",IF(E31=\"Spieler 40\",\"Sieger 29\",IF(D31=E31,\"Freilos\",IF(E31=\"Freilos\",D31,IF(D31=\"Freilos\",E31,IF(F31>G31,D31,IF(G31>F31,E31,\"Sieger 29\")))))))","v":"Sieger 29"},{"$f":"IF(D32=\"Spieler 24\",\"Sieger 30\",IF(E32=\"Spieler 56\",\"Sieger 30\",IF(D32=E32,\"Freilos\",IF(E32=\"Freilos\",D32,IF(D32=\"Freilos\",E32,IF(F32>G32,D32,IF(G32>F32,E32,\"Sieger 30\")))))))","v":"Sieger 30"},null,null,null,null,null,null,null,null,0,0,0,0,0,0,0,0,63,{"$f":"IF(Auslosung_Turnierdaten!F71=\"\",\"Spieler 63\",Auslosung_Turnierdaten!F71)","v":"Spieler 63"},0,0,0,0,0,0,0,0,0,0,0,0,0,0,0,null,null,null,0,{"$f":"IF(AND(COUNTIF(L65:L65:$L$129,L65)=1,F65+G65>0),L65 & \"-\",\"\")","v":""},"",null,null,""]
[null,null,64,{"$f":"IF(D33=\"Spieler 16\",\"Sieger 31\",IF(E33=\"Spieler 48\",\"Sieger 31\",IF(D33=E33,\"Freilos\",IF(E33=\"Freilos\",D33,IF(D33=\"Freilos\",E33,IF(F33>G33,D33,IF(G33>F33,E33,\"Sieger 31\")))))))","v":"Sieger 31"},{"$f":"IF(D34=\"Spieler 32\",\"Sieger 32\",IF(E34=\"Spieler 64\",\"Sieger 32\",IF(D34=E34,\"Freilos\",IF(E34=\"Freilos\",D34,IF(D34=\"Freilos\",E34,IF(F34>G34,D34,IF(G34>F34,E34,\"Sieger 32\")))))))","v":"Sieger 32"},null,null,null,null,null,null,null,null,0,0,0,0,0,0,0,0,64,{"$f":"IF(Auslosung_Turnierdaten!F72=\"\",\"Spieler 64\",Auslosung_Turnierdaten!F72)","v":"Spieler 64"},0,0,0,0,0,0,0,0,0,0,0,0,0,0,0,null,null,null,0,{"$f":"IF(AND(COUNTIF(L66:L66:$L$129,L66)=1,F66+G66>0),L66 & \"-\",\"\")","v":""},"",null,null,""]
[null,"VR2",65,{"$f":"IF(D35=\"Verlierer 1\",\"Sieger 33\",IF(E35=\"Verlierer 2\",\"Sieger 33\",IF(D35=E35,\"Freilos\",IF(E35=\"Freilos\",D35,IF(D35=\"Freilos\",E35,IF(F35>G35,D35,IF(G35>F35,E35,\"Sieger 33\")))))))","v":"Sieger 33"},{"$f":"IF(D66=\"Sieger 31\",\"Verlierer 64\",IF(E66=\"Sieger 32\",\"Verlierer 64\",IF(D66=E66,\"Freilos\",IF(E66=\"Freilos\",E66,IF(D66=\"Freilos\",D66,IF(F66>G66,E66,IF(G66>F66,D66,\"Verlierer 64\")))))))","v":"Verlierer 64"},null,null,null,null,null,null,null,{"$f":"IF(F67>G67,E67,IF(G67>F67,D67,\"\"))","v":""},{"$f":"F67+G67","v":0},{"$f":"N67","v":0},{"$f":"IF(D67=\"Freilos\",0,IF(F67<G67,1,IF(F67>G67,1,0)))","v":0},{"$f":"IF(D67=\"Freilos\",0,IF(F67<G67,1,IF(F67>G67,1,0)))","v":0},{"$f":"IF(D67=\"Freilos\",0,IF(F67>G67,1,0))","v":0},{"$f":"IF(D67=\"Freilos\",0,IF(G67>F67,1,0))","v":0},{"$f":"IF(E67=\"Freilos\",3,IF(F67>G67,3,0))","v":0},{"$f":"IF(D67=\"Freilos\",3,IF(G67>F67,3,0))","v":0},"lfdNr","Name, Vorname","Verein","Verein_Nr","Lfd_Nr","Punkte","GP","VP",{"$f":"IF(SUM('SP64'!AF3:'SP64'!AI66)>0,\"Points\",\"GSp\")","v":"GSp"},{"$f":"IF(SUM('SP64'!AF3:'SP64'!AI66)>0,\"Aufn\",\"VSp\")","v":"VSp"},{"$f":"IF(SUM('SP64'!AF3:'SP64'!AI66)>0,\"GD\",\"Quot\")","v":"Quot"},{"$f":"IF(SUM('SP64'!AF3:'SP64'!AI66)>0,\"BED\",\"\")","v":""},{"$f":"IF(SUM('SP64'!AF3:'SP64'!AI66)>0,\"HS\",\"\")","v":""},null,null,null,null,null,null,null,0,{"$f":"IF(AND(COUNTIF(L67:L67:$L$129,L67)=1,F67+G67>0),L67 & \"-\",\"\")","v":""},"",null,null,""]
[null,null,66,{"$f":"IF(D36=\"Verlierer 3\",\"Sieger 34\",IF(E36=\"Verlierer 4\",\"Sieger 34\",IF(D36=E36,\"Freilos\",IF(E36=\"Freilos\",D36,IF(D36=\"Freilos\",E36,IF(F36>G36,D36,IF(G36>F36,E36,\"Sieger 34\")))))))","v":"Sieger 34"},{"$f":"IF(D65=\"Sieger 29\",\"Verlierer 63\",IF(E65=\"Sieger 30\",\"Verlierer 63\",IF(D65=E65,\"Freilos\",IF(E65=\"Freilos\",E65,IF(D65=\"Freilos\",D65,IF(F65>G65,E65,IF(G65>F65,D65,\"Verlierer 63\")))))))","v":"Verlierer 63"},null,null,null,null,null,null,null,"",{"$f":"F68+G68","v":0},{"$f":"N68","v":0},{"$f":"IF(D68=\"Freilos\",0,IF(F68<G68,1,IF(F68>G68,1,0)))","v":0},{"$f":"IF(D68=\"Freilos\",0,IF(F68<G68,1,IF(F68>G68,1,0)))","v":0},{"$f":"IF(D68=\"Freilos\",0,IF(F68>G68,1,0))","v":0},{"$f":"IF(D68=\"Freilos\",0,IF(G68>F68,1,0))","v":0},{"$f":"IF(E68=\"Freilos\",3,IF(F68>G68,3,0))","v":0},{"$f":"IF(D68=\"Freilos\",3,IF(G68>F68,3,0))","v":0},{"$f":"IF(Auslosung_Turnierdaten!F9=\"\",\"\",1)","v":""},{"$f":"IF('SP64'!V68=\"\",\"\",Auslosung_Turnierdaten!F9)","v":""},{"$f":"IF('SP64'!V68=\"\",\"\",Auslosung_Turnierdaten!G9)","v":""},{"$f":"IF('SP64'!V68=\"\",\"\",Auslosung_Turnierdaten!H9)","v":""},{"$f":"IF('SP64'!V68=\"\",\"\",Auslosung_Turnierdaten!I9)","v":""},{"$f":"IF('SP64'!V68=\"\",\"\",'SP64'!X3)","v":""},{"$f":"IF('SP64'!V68=\"\",\"\",'SP64'!Z3)","v":""},{"$f":"IF('SP64'!V68=\"\",\"\",'SP64'!AA3)","v":""},{"$f":"IF('SP64'!V68=\"\",\"\",'SP64'!AC3)","v":""},{"$f":"IF('SP64'!V68=\"\",\"\",IF($AE$67=\"VSp\",'SP64'!AD3,'SP64'!AF3))","v":""},{"$f":"IF('SP64'!V68=\"\",\"\",IF($AF$67=\"Quot\",'SP64'!AE3,'SP64'!AG3))","v":""},{"$f":"IF($AG$67=\"BED\",'SP64'!AH3,\"\")","v":""},{"$f":"IF($AH$67=\"HS\",'SP64'!AI3,\"\")","v":""},null,null,null,null,null,null,null,{"$f":"IF(T68+U68>0,\"\",L68)","v":0},{"$f":"IF(AND(COUNTIF(L68:L68:$L$129,L68)=1,F68+G68>0),L68 & \"-\",\"\")","v":""},{"$f":"IF(OR(D68=\"Freilos\",E68=\"Freilos\"),1,\"\")","v":""},null,null,{"$f":"IF(AT68>AS68,IF(AND(AR68=\"\",AT68 =\"\"),\"\",AT68-AS68),\"\")","v":""}]
[null,null,67,{"$f":"IF(D37=\"Verlierer 5\",\"Sieger 35\",IF(E37=\"Verlierer 6\",\"Sieger 35\",IF(D37=E37,\"Freilos\",IF(E37=\"Freilos\",D37,IF(D37=\"Freilos\",E37,IF(F37>G37,D37,IF(G37>F37,E37,\"Sieger 35\")))))))","v":"Sieger 35"},{"$f":"IF(D64=\"Sieger 27\",\"Verlierer 62\",IF(E64=\"Sieger 28\",\"Verlierer 62\",IF(D64=E64,\"Freilos\",IF(E64=\"Freilos\",E64,IF(D64=\"Freilos\",D64,IF(F64>G64,E64,IF(G64>F64,D64,\"Verlierer 62\")))))))","v":"Verlierer 62"},null,null,null,null,null,null,null,"",0,0,0,{"$f":"IF(D69=\"Freilos\",0,IF(F69<G69,1,IF(F69>G69,1,0)))","v":0},0,0,0,0,{"$f":"IF(Auslosung_Turnierdaten!F10=\"\",\"\",2)","v":""},{"$f":"IF('SP64'!V69=\"\",\"\",Auslosung_Turnierdaten!F10)","v":""},{"$f":"IF('SP64'!V69=\"\",\"\",Auslosung_Turnierdaten!G10)","v":""},{"$f":"IF('SP64'!V69=\"\",\"\",Auslosung_Turnierdaten!H10)","v":""},{"$f":"IF('SP64'!V69=\"\",\"\",Auslosung_Turnierdaten!I10)","v":""},{"$f":"IF('SP64'!V69=\"\",\"\",'SP64'!X4)","v":""},{"$f":"IF('SP64'!V69=\"\",\"\",'SP64'!Z4)","v":""},{"$f":"IF('SP64'!V69=\"\",\"\",'SP64'!AA4)","v":""},{"$f":"IF('SP64'!V69=\"\",\"\",'SP64'!AC4)","v":""},{"$f":"IF('SP64'!V69=\"\",\"\",IF($AE$67=\"VSp\",'SP64'!AD4,'SP64'!AF4))","v":""},{"$f":"IF('SP64'!V69=\"\",\"\",IF($AF$67=\"Quot\",'SP64'!AE4,'SP64'!AG4))","v":""},{"$f":"IF($AG$67=\"BED\",'SP64'!AH4,\"\")","v":""},{"$f":"IF($AH$67=\"HS\",'SP64'!AI4,\"\")","v":""},null,null,null,null,null,null,null,0,{"$f":"IF(AND(COUNTIF(L69:L69:$L$129,L69)=1,F69+G69>0),L69 & \"-\",\"\")","v":""},"",null,null,""]
[null,null,68,{"$f":"IF(D38=\"Verlierer 7\",\"Sieger 36\",IF(E38=\"Verlierer 8\",\"Sieger 36\",IF(D38=E38,\"Freilos\",IF(E38=\"Freilos\",D38,IF(D38=\"Freilos\",E38,IF(F38>G38,D38,IF(G38>F38,E38,\"Sieger 36\")))))))","v":"Sieger 36"},{"$f":"IF(D63=\"Sieger 25\",\"Verlierer 61\",IF(E63=\"Sieger 26\",\"Verlierer 61\",IF(D63=E63,\"Freilos\",IF(E63=\"Freilos\",E63,IF(D63=\"Freilos\",D63,IF(F63>G63,E63,IF(G63>F63,D63,\"Verlierer 61\")))))))","v":"Verlierer 61"},null,null,null,null,null,null,null,"",0,0,0,0,0,0,0,0,{"$f":"IF(Auslosung_Turnierdaten!F11=\"\",\"\",3)","v":""},{"$f":"IF('SP64'!V70=\"\",\"\",Auslosung_Turnierdaten!F11)","v":""},{"$f":"IF('SP64'!V70=\"\",\"\",Auslosung_Turnierdaten!G11)","v":""},{"$f":"IF('SP64'!V70=\"\",\"\",Auslosung_Turnierdaten!H11)","v":""},{"$f":"IF('SP64'!V70=\"\",\"\",Auslosung_Turnierdaten!I11)","v":""},{"$f":"IF('SP64'!V70=\"\",\"\",'SP64'!X5)","v":""},{"$f":"IF('SP64'!V70=\"\",\"\",'SP64'!Z5)","v":""},{"$f":"IF('SP64'!V70=\"\",\"\",'SP64'!AA5)","v":""},{"$f":"IF('SP64'!V70=\"\",\"\",'SP64'!AC5)","v":""},{"$f":"IF('SP64'!V70=\"\",\"\",IF($AE$67=\"VSp\",'SP64'!AD5,'SP64'!AF5))","v":""},{"$f":"IF('SP64'!V70=\"\",\"\",IF($AF$67=\"Quot\",'SP64'!AE5,'SP64'!AG5))","v":""},{"$f":"IF($AG$67=\"BED\",'SP64'!AH5,\"\")","v":""},{"$f":"IF($AH$67=\"HS\",'SP64'!AI5,\"\")","v":""},null,null,null,null,null,null,null,0,{"$f":"IF(AND(COUNTIF(L70:L70:$L$129,L70)=1,F70+G70>0),L70 & \"-\",\"\")","v":""},"",null,null,""]
[null,null,69,{"$f":"IF(D39=\"Verlierer 9\",\"Sieger 37\",IF(E39=\"Verlierer 10\",\"Sieger 37\",IF(D39=E39,\"Freilos\",IF(E39=\"Freilos\",D39,IF(D39=\"Freilos\",E39,IF(F39>G39,D39,IF(G39>F39,E39,\"Sieger 37\")))))))","v":"Sieger 37"},{"$f":"IF(D62=\"Sieger 23\",\"Verlierer 60\",IF(E62=\"Sieger 24\",\"Verlierer 60\",IF(D62=E62,\"Freilos\",IF(E62=\"Freilos\",E62,IF(D62=\"Freilos\",D62,IF(F62>G62,E62,IF(G62>F62,D62,\"Verlierer 60\")))))))","v":"Verlierer 60"},null,null,null,null,null,null,null,"",0,0,0,0,0,0,0,0,{"$f":"IF(Auslosung_Turnierdaten!F12=\"\",\"\",4)","v":""},{"$f":"IF('SP64'!V71=\"\",\"\",Auslosung_Turnierdaten!F12)","v":""},{"$f":"IF('SP64'!V71=\"\",\"\",Auslosung_Turnierdaten!G12)","v":""},{"$f":"IF('SP64'!V71=\"\",\"\",Auslosung_Turnierdaten!H12)","v":""},{"$f":"IF('SP64'!V71=\"\",\"\",Auslosung_Turnierdaten!I12)","v":""},{"$f":"IF('SP64'!V71=\"\",\"\",'SP64'!X6)","v":""},{"$f":"IF('SP64'!V71=\"\",\"\",'SP64'!Z6)","v":""},{"$f":"IF('SP64'!V71=\"\",\"\",'SP64'!AA6)","v":""},{"$f":"IF('SP64'!V71=\"\",\"\",'SP64'!AC6)","v":""},{"$f":"IF('SP64'!V71=\"\",\"\",IF($AE$67=\"VSp\",'SP64'!AD6,'SP64'!AF6))","v":""},{"$f":"IF('SP64'!V71=\"\",\"\",IF($AF$67=\"Quot\",'SP64'!AE6,'SP64'!AG6))","v":""},{"$f":"IF($AG$67=\"BED\",'SP64'!AH6,\"\")","v":""},{"$f":"IF($AH$67=\"HS\",'SP64'!AI6,\"\")","v":""},null,null,null,null,null,null,null,0,{"$f":"IF(AND(COUNTIF(L71:L71:$L$129,L71)=1,F71+G71>0),L71 & \"-\",\"\")","v":""},"",null,null,""]
[null,null,70,{"$f":"IF(D40=\"Verlierer 11\",\"Sieger 38\",IF(E40=\"Verlierer 12\",\"Sieger 38\",IF(D40=E40,\"Freilos\",IF(E40=\"Freilos\",D40,IF(D40=\"Freilos\",E40,IF(F40>G40,D40,IF(G40>F40,E40,\"Sieger 38\")))))))","v":"Sieger 38"},{"$f":"IF(D61=\"Sieger 21\",\"Verlierer 59\",IF(E61=\"Sieger 22\",\"Verlierer 59\",IF(D61=E61,\"Freilos\",IF(E61=\"Freilos\",E61,IF(D61=\"Freilos\",D61,IF(F61>G61,E61,IF(G61>F61,D61,\"Verlierer 59\")))))))","v":"Verlierer 59"},null,null,null,null,null,null,null,"",0,0,0,0,0,0,0,0,{"$f":"IF(Auslosung_Turnierdaten!F13=\"\",\"\",5)","v":""},{"$f":"IF('SP64'!V72=\"\",\"\",Auslosung_Turnierdaten!F13)","v":""},{"$f":"IF('SP64'!V72=\"\",\"\",Auslosung_Turnierdaten!G13)","v":""},{"$f":"IF('SP64'!V72=\"\",\"\",Auslosung_Turnierdaten!H13)","v":""},{"$f":"IF('SP64'!V72=\"\",\"\",Auslosung_Turnierdaten!I13)","v":""},{"$f":"IF('SP64'!V72=\"\",\"\",'SP64'!X7)","v":""},{"$f":"IF('SP64'!V72=\"\",\"\",'SP64'!Z7)","v":""},{"$f":"IF('SP64'!V72=\"\",\"\",'SP64'!AA7)","v":""},{"$f":"IF('SP64'!V72=\"\",\"\",'SP64'!AC7)","v":""},{"$f":"IF('SP64'!V72=\"\",\"\",IF($AE$67=\"VSp\",'SP64'!AD7,'SP64'!AF7))","v":""},{"$f":"IF('SP64'!V72=\"\",\"\",IF($AF$67=\"Quot\",'SP64'!AE7,'SP64'!AG7))","v":""},{"$f":"IF($AG$67=\"BED\",'SP64'!AH7,\"\")","v":""},{"$f":"IF($AH$67=\"HS\",'SP64'!AI7,\"\")","v":""},null,null,null,null,null,null,null,0,{"$f":"IF(AND(COUNTIF(L72:L72:$L$129,L72)=1,F72+G72>0),L72 & \"-\",\"\")","v":""},"",null,null,""]
[null,null,71,{"$f":"IF(D41=\"Verlierer 13\",\"Sieger 39\",IF(E41=\"Verlierer 14\",\"Sieger 39\",IF(D41=E41,\"Freilos\",IF(E41=\"Freilos\",D41,IF(D41=\"Freilos\",E41,IF(F41>G41,D41,IF(G41>F41,E41,\"Sieger 39\")))))))","v":"Sieger 39"},{"$f":"IF(D60=\"Sieger 19\",\"Verlierer 58\",IF(E60=\"Sieger 20\",\"Verlierer 58\",IF(D60=E60,\"Freilos\",IF(E60=\"Freilos\",E60,IF(D60=\"Freilos\",D60,IF(F60>G60,E60,IF(G60>F60,D60,\"Verlierer 58\")))))))","v":"Verlierer 58"},null,null,null,null,null,null,null,"",0,0,0,0,0,0,0,0,{"$f":"IF(Auslosung_Turnierdaten!F14=\"\",\"\",6)","v":""},{"$f":"IF('SP64'!V73=\"\",\"\",Auslosung_Turnierdaten!F14)","v":""},{"$f":"IF('SP64'!V73=\"\",\"\",Auslosung_Turnierdaten!G14)","v":""},{"$f":"IF('SP64'!V73=\"\",\"\",Auslosung_Turnierdaten!H14)","v":""},{"$f":"IF('SP64'!V73=\"\",\"\",Auslosung_Turnierdaten!I14)","v":""},{"$f":"IF('SP64'!V73=\"\",\"\",'SP64'!X8)","v":""},{"$f":"IF('SP64'!V73=\"\",\"\",'SP64'!Z8)","v":""},{"$f":"IF('SP64'!V73=\"\",\"\",'SP64'!AA8)","v":""},{"$f":"IF('SP64'!V73=\"\",\"\",'SP64'!AC8)","v":""},{"$f":"IF('SP64'!V73=\"\",\"\",IF($AE$67=\"VSp\",'SP64'!AD8,'SP64'!AF8))","v":""},{"$f":"IF('SP64'!V73=\"\",\"\",IF($AF$67=\"Quot\",'SP64'!AE8,'SP64'!AG8))","v":""},{"$f":"IF($AG$67=\"BED\",'SP64'!AH8,\"\")","v":""},{"$f":"IF($AH$67=\"HS\",'SP64'!AI8,\"\")","v":""},null,null,null,null,null,null,null,0,{"$f":"IF(AND(COUNTIF(L73:L73:$L$129,L73)=1,F73+G73>0),L73 & \"-\",\"\")","v":""},"",null,null,""]
[null,null,72,{"$f":"IF(D42=\"Verlierer 15\",\"Sieger 40\",IF(E42=\"Verlierer 16\",\"Sieger 40\",IF(D42=E42,\"Freilos\",IF(E42=\"Freilos\",D42,IF(D42=\"Freilos\",E42,IF(F42>G42,D42,IF(G42>F42,E42,\"Sieger 40\")))))))","v":"Sieger 40"},{"$f":"IF(D59=\"Sieger 17\",\"Verlierer 57\",IF(E59=\"Sieger 18\",\"Verlierer 57\",IF(D59=E59,\"Freilos\",IF(E59=\"Freilos\",E59,IF(D59=\"Freilos\",D59,IF(F59>G59,E59,IF(G59>F59,D59,\"Verlierer 57\")))))))","v":"Verlierer 57"},null,null,null,null,null,null,null,"",0,0,0,0,0,0,0,0,{"$f":"IF(Auslosung_Turnierdaten!F15=\"\",\"\",7)","v":""},{"$f":"IF('SP64'!V74=\"\",\"\",Auslosung_Turnierdaten!F15)","v":""},{"$f":"IF('SP64'!V74=\"\",\"\",Auslosung_Turnierdaten!G15)","v":""},{"$f":"IF('SP64'!V74=\"\",\"\",Auslosung_Turnierdaten!H15)","v":""},{"$f":"IF('SP64'!V74=\"\",\"\",Auslosung_Turnierdaten!I15)","v":""},{"$f":"IF('SP64'!V74=\"\",\"\",'SP64'!X9)","v":""},{"$f":"IF('SP64'!V74=\"\",\"\",'SP64'!Z9)","v":""},{"$f":"IF('SP64'!V74=\"\",\"\",'SP64'!AA9)","v":""},{"$f":"IF('SP64'!V74=\"\",\"\",'SP64'!AC9)","v":""},{"$f":"IF('SP64'!V74=\"\",\"\",IF($AE$67=\"VSp\",'SP64'!AD9,'SP64'!AF9))","v":""},{"$f":"IF('SP64'!V74=\"\",\"\",IF($AF$67=\"Quot\",'SP64'!AE9,'SP64'!AG9))","v":""},{"$f":"IF($AG$67=\"BED\",'SP64'!AH9,\"\")","v":""},{"$f":"IF($AH$67=\"HS\",'SP64'!AI9,\"\")","v":""},null,null,null,null,null,null,null,0,{"$f":"IF(AND(COUNTIF(L74:L74:$L$129,L74)=1,F74+G74>0),L74 & \"-\",\"\")","v":""},"",null,null,""]
[null,null,73,{"$f":"IF(D43=\"Verlierer 17\",\"Sieger 41\",IF(E43=\"Verlierer 18\",\"Sieger 41\",IF(D43=E43,\"Freilos\",IF(E43=\"Freilos\",D43,IF(D43=\"Freilos\",E43,IF(F43>G43,D43,IF(G43>F43,E43,\"Sieger 41\")))))))","v":"Sieger 41"},{"$f":"IF(D58=\"Sieger 15\",\"Verlierer 56\",IF(E58=\"Sieger 16\",\"Verlierer 56\",IF(D58=E58,\"Freilos\",IF(E58=\"Freilos\",E58,IF(D58=\"Freilos\",D58,IF(F58>G58,E58,IF(G58>F58,D58,\"Verlierer 56\")))))))","v":"Verlierer 56"},null,null,null,null,null,null,null,"",0,0,0,0,0,0,0,0,{"$f":"IF(Auslosung_Turnierdaten!F16=\"\",\"\",8)","v":""},{"$f":"IF('SP64'!V75=\"\",\"\",Auslosung_Turnierdaten!F16)","v":""},{"$f":"IF('SP64'!V75=\"\",\"\",Auslosung_Turnierdaten!G16)","v":""},{"$f":"IF('SP64'!V75=\"\",\"\",Auslosung_Turnierdaten!H16)","v":""},{"$f":"IF('SP64'!V75=\"\",\"\",Auslosung_Turnierdaten!I16)","v":""},{"$f":"IF('SP64'!V75=\"\",\"\",'SP64'!X10)","v":""},{"$f":"IF('SP64'!V75=\"\",\"\",'SP64'!Z10)","v":""},{"$f":"IF('SP64'!V75=\"\",\"\",'SP64'!AA10)","v":""},{"$f":"IF('SP64'!V75=\"\",\"\",'SP64'!AC10)","v":""},{"$f":"IF('SP64'!V75=\"\",\"\",IF($AE$67=\"VSp\",'SP64'!AD10,'SP64'!AF10))","v":""},{"$f":"IF('SP64'!V75=\"\",\"\",IF($AF$67=\"Quot\",'SP64'!AE10,'SP64'!AG10))","v":""},{"$f":"IF($AG$67=\"BED\",'SP64'!AH10,\"\")","v":""},{"$f":"IF($AH$67=\"HS\",'SP64'!AI10,\"\")","v":""},null,null,null,null,null,null,null,0,{"$f":"IF(AND(COUNTIF(L75:L75:$L$129,L75)=1,F75+G75>0),L75 & \"-\",\"\")","v":""},"",null,null,""]
[null,null,74,{"$f":"IF(D44=\"Verlierer 19\",\"Sieger 42\",IF(E44=\"Verlierer 20\",\"Sieger 42\",IF(D44=E44,\"Freilos\",IF(E44=\"Freilos\",D44,IF(D44=\"Freilos\",E44,IF(F44>G44,D44,IF(G44>F44,E44,\"Sieger 42\")))))))","v":"Sieger 42"},{"$f":"IF(D57=\"Sieger 13\",\"Verlierer 55\",IF(E57=\"Sieger 14\",\"Verlierer 55\",IF(D57=E57,\"Freilos\",IF(E57=\"Freilos\",E57,IF(D57=\"Freilos\",D57,IF(F57>G57,E57,IF(G57>F57,D57,\"Verlierer 55\")))))))","v":"Verlierer 55"},null,null,null,null,null,null,null,"",0,0,0,0,0,0,0,0,{"$f":"IF(Auslosung_Turnierdaten!F17=\"\",\"\",9)","v":""},{"$f":"IF('SP64'!V76=\"\",\"\",Auslosung_Turnierdaten!F17)","v":""},{"$f":"IF('SP64'!V76=\"\",\"\",Auslosung_Turnierdaten!G17)","v":""},{"$f":"IF('SP64'!V76=\"\",\"\",Auslosung_Turnierdaten!H17)","v":""},{"$f":"IF('SP64'!V76=\"\",\"\",Auslosung_Turnierdaten!I17)","v":""},{"$f":"IF('SP64'!V76=\"\",\"\",'SP64'!X11)","v":""},{"$f":"IF('SP64'!V76=\"\",\"\",'SP64'!Z11)","v":""},{"$f":"IF('SP64'!V76=\"\",\"\",'SP64'!AA11)","v":""},{"$f":"IF('SP64'!V76=\"\",\"\",'SP64'!AC11)","v":""},{"$f":"IF('SP64'!V76=\"\",\"\",IF($AE$67=\"VSp\",'SP64'!AD11,'SP64'!AF11))","v":""},{"$f":"IF('SP64'!V76=\"\",\"\",IF($AF$67=\"Quot\",'SP64'!AE11,'SP64'!AG11))","v":""},{"$f":"IF($AG$67=\"BED\",'SP64'!AH11,\"\")","v":""},{"$f":"IF($AH$67=\"HS\",'SP64'!AI11,\"\")","v":""},null,null,null,null,null,null,null,0,{"$f":"IF(AND(COUNTIF(L76:L76:$L$129,L76)=1,F76+G76>0),L76 & \"-\",\"\")","v":""},"",null,null,""]
[null,null,75,{"$f":"IF(D45=\"Verlierer 21\",\"Sieger 43\",IF(E45=\"Verlierer 22\",\"Sieger 43\",IF(D45=E45,\"Freilos\",IF(E45=\"Freilos\",D45,IF(D45=\"Freilos\",E45,IF(F45>G45,D45,IF(G45>F45,E45,\"Sieger 43\")))))))","v":"Sieger 43"},{"$f":"IF(D56=\"Sieger 11\",\"Verlierer 54\",IF(E56=\"Sieger 12\",\"Verlierer 54\",IF(D56=E56,\"Freilos\",IF(E56=\"Freilos\",E56,IF(D56=\"Freilos\",D56,IF(F56>G56,E56,IF(G56>F56,D56,\"Verlierer 54\")))))))","v":"Verlierer 54"},null,null,null,null,null,null,null,"",0,0,0,0,0,0,0,0,{"$f":"IF(Auslosung_Turnierdaten!F18=\"\",\"\",10)","v":""},{"$f":"IF('SP64'!V77=\"\",\"\",Auslosung_Turnierdaten!F18)","v":""},{"$f":"IF('SP64'!V77=\"\",\"\",Auslosung_Turnierdaten!G18)","v":""},{"$f":"IF('SP64'!V77=\"\",\"\",Auslosung_Turnierdaten!H18)","v":""},{"$f":"IF('SP64'!V77=\"\",\"\",Auslosung_Turnierdaten!I18)","v":""},{"$f":"IF('SP64'!V77=\"\",\"\",'SP64'!X12)","v":""},{"$f":"IF('SP64'!V77=\"\",\"\",'SP64'!Z12)","v":""},{"$f":"IF('SP64'!V77=\"\",\"\",'SP64'!AA12)","v":""},{"$f":"IF('SP64'!V77=\"\",\"\",'SP64'!AC12)","v":""},{"$f":"IF('SP64'!V77=\"\",\"\",IF($AE$67=\"VSp\",'SP64'!AD12,'SP64'!AF12))","v":""},{"$f":"IF('SP64'!V77=\"\",\"\",IF($AF$67=\"Quot\",'SP64'!AE12,'SP64'!AG12))","v":""},{"$f":"IF($AG$67=\"BED\",'SP64'!AH12,\"\")","v":""},{"$f":"IF($AH$67=\"HS\",'SP64'!AI12,\"\")","v":""},null,null,null,null,null,null,null,0,{"$f":"IF(AND(COUNTIF(L77:L77:$L$129,L77)=1,F77+G77>0),L77 & \"-\",\"\")","v":""},"",null,null,""]
[null,null,76,{"$f":"IF(D46=\"Verlierer 23\",\"Sieger 44\",IF(E46=\"Verlierer 24\",\"Sieger 44\",IF(D46=E46,\"Freilos\",IF(E46=\"Freilos\",D46,IF(D46=\"Freilos\",E46,IF(F46>G46,D46,IF(G46>F46,E46,\"Sieger 44\")))))))","v":"Sieger 44"},{"$f":"IF(D55=\"Sieger 9\",\"Verlierer 53\",IF(E55=\"Sieger 10\",\"Verlierer 53\",IF(D55=E55,\"Freilos\",IF(E55=\"Freilos\",E55,IF(D55=\"Freilos\",D55,IF(F55>G55,E55,IF(G55>F55,D55,\"Verlierer 53\")))))))","v":"Verlierer 53"},null,null,null,null,null,null,null,"",0,0,0,0,0,0,0,0,{"$f":"IF(Auslosung_Turnierdaten!F19=\"\",\"\",11)","v":""},{"$f":"IF('SP64'!V78=\"\",\"\",Auslosung_Turnierdaten!F19)","v":""},{"$f":"IF('SP64'!V78=\"\",\"\",Auslosung_Turnierdaten!G19)","v":""},{"$f":"IF('SP64'!V78=\"\",\"\",Auslosung_Turnierdaten!H19)","v":""},{"$f":"IF('SP64'!V78=\"\",\"\",Auslosung_Turnierdaten!I19)","v":""},{"$f":"IF('SP64'!V78=\"\",\"\",'SP64'!X13)","v":""},{"$f":"IF('SP64'!V78=\"\",\"\",'SP64'!Z13)","v":""},{"$f":"IF('SP64'!V78=\"\",\"\",'SP64'!AA13)","v":""},{"$f":"IF('SP64'!V78=\"\",\"\",'SP64'!AC13)","v":""},{"$f":"IF('SP64'!V78=\"\",\"\",IF($AE$67=\"VSp\",'SP64'!AD13,'SP64'!AF13))","v":""},{"$f":"IF('SP64'!V78=\"\",\"\",IF($AF$67=\"Quot\",'SP64'!AE13,'SP64'!AG13))","v":""},{"$f":"IF($AG$67=\"BED\",'SP64'!AH13,\"\")","v":""},{"$f":"IF($AH$67=\"HS\",'SP64'!AI13,\"\")","v":""},null,null,null,null,null,null,null,0,{"$f":"IF(AND(COUNTIF(L78:L78:$L$129,L78)=1,F78+G78>0),L78 & \"-\",\"\")","v":""},"",null,null,""]
[null,null,77,{"$f":"IF(D47=\"Verlierer 25\",\"Sieger 45\",IF(E47=\"Verlierer 26\",\"Sieger 45\",IF(D47=E47,\"Freilos\",IF(E47=\"Freilos\",D47,IF(D47=\"Freilos\",E47,IF(F47>G47,D47,IF(G47>F47,E47,\"Sieger 45\")))))))","v":"Sieger 45"},{"$f":"IF(D54=\"Sieger 7\",\"Verlierer 52\",IF(E54=\"Sieger 8\",\"Verlierer 52\",IF(D54=E54,\"Freilos\",IF(E54=\"Freilos\",E54,IF(D54=\"Freilos\",D54,IF(F54>G54,E54,IF(G54>F54,D54,\"Verlierer 52\")))))))","v":"Verlierer 52"},null,null,null,null,null,null,null,"",0,0,0,0,0,0,0,0,{"$f":"IF(Auslosung_Turnierdaten!F20=\"\",\"\",12)","v":""},{"$f":"IF('SP64'!V79=\"\",\"\",Auslosung_Turnierdaten!F20)","v":""},{"$f":"IF('SP64'!V79=\"\",\"\",Auslosung_Turnierdaten!G20)","v":""},{"$f":"IF('SP64'!V79=\"\",\"\",Auslosung_Turnierdaten!H20)","v":""},{"$f":"IF('SP64'!V79=\"\",\"\",Auslosung_Turnierdaten!I20)","v":""},{"$f":"IF('SP64'!V79=\"\",\"\",'SP64'!X14)","v":""},{"$f":"IF('SP64'!V79=\"\",\"\",'SP64'!Z14)","v":""},{"$f":"IF('SP64'!V79=\"\",\"\",'SP64'!AA14)","v":""},{"$f":"IF('SP64'!V79=\"\",\"\",'SP64'!AC14)","v":""},{"$f":"IF('SP64'!V79=\"\",\"\",IF($AE$67=\"VSp\",'SP64'!AD14,'SP64'!AF14))","v":""},{"$f":"IF('SP64'!V79=\"\",\"\",IF($AF$67=\"Quot\",'SP64'!AE14,'SP64'!AG14))","v":""},{"$f":"IF($AG$67=\"BED\",'SP64'!AH14,\"\")","v":""},{"$f":"IF($AH$67=\"HS\",'SP64'!AI14,\"\")","v":""},null,null,null,null,null,null,null,0,{"$f":"IF(AND(COUNTIF(L79:L79:$L$129,L79)=1,F79+G79>0),L79 & \"-\",\"\")","v":""},"",null,null,""]
[null,null,78,{"$f":"IF(D48=\"Verlierer 27\",\"Sieger 46\",IF(E48=\"Verlierer 28\",\"Sieger 46\",IF(D48=E48,\"Freilos\",IF(E48=\"Freilos\",D48,IF(D48=\"Freilos\",E48,IF(F48>G48,D48,IF(G48>F48,E48,\"Sieger 46\")))))))","v":"Sieger 46"},{"$f":"IF(D53=\"Sieger 5\",\"Verlierer 51\",IF(E53=\"Sieger 6\",\"Verlierer 51\",IF(D53=E53,\"Freilos\",IF(E53=\"Freilos\",E53,IF(D53=\"Freilos\",D53,IF(F53>G53,E53,IF(G53>F53,D53,\"Verlierer 51\")))))))","v":"Verlierer 51"},null,null,null,null,null,null,null,"",0,0,0,0,0,0,0,0,{"$f":"IF(Auslosung_Turnierdaten!F21=\"\",\"\",13)","v":""},{"$f":"IF('SP64'!V80=\"\",\"\",Auslosung_Turnierdaten!F21)","v":""},{"$f":"IF('SP64'!V80=\"\",\"\",Auslosung_Turnierdaten!G21)","v":""},{"$f":"IF('SP64'!V80=\"\",\"\",Auslosung_Turnierdaten!H21)","v":""},{"$f":"IF('SP64'!V80=\"\",\"\",Auslosung_Turnierdaten!I21)","v":""},{"$f":"IF('SP64'!V80=\"\",\"\",'SP64'!X15)","v":""},{"$f":"IF('SP64'!V80=\"\",\"\",'SP64'!Z15)","v":""},{"$f":"IF('SP64'!V80=\"\",\"\",'SP64'!AA15)","v":""},{"$f":"IF('SP64'!V80=\"\",\"\",'SP64'!AC15)","v":""},{"$f":"IF('SP64'!V80=\"\",\"\",IF($AE$67=\"VSp\",'SP64'!AD15,'SP64'!AF15))","v":""},{"$f":"IF('SP64'!V80=\"\",\"\",IF($AF$67=\"Quot\",'SP64'!AE15,'SP64'!AG15))","v":""},{"$f":"IF($AG$67=\"BED\",'SP64'!AH15,\"\")","v":""},{"$f":"IF($AH$67=\"HS\",'SP64'!AI15,\"\")","v":""},null,null,null,null,null,null,null,0,{"$f":"IF(AND(COUNTIF(L80:L80:$L$129,L80)=1,F80+G80>0),L80 & \"-\",\"\")","v":""},"",null,null,""]
[null,null,79,{"$f":"IF(D49=\"Verlierer 29\",\"Sieger 47\",IF(E49=\"Verlierer 30\",\"Sieger 47\",IF(D49=E49,\"Freilos\",IF(E49=\"Freilos\",D49,IF(D49=\"Freilos\",E49,IF(F49>G49,D49,IF(G49>F49,E49,\"Sieger 47\")))))))","v":"Sieger 47"},{"$f":"IF(D52=\"Sieger 3\",\"Verlierer 50\",IF(E52=\"Sieger 4\",\"Verlierer 50\",IF(D52=E52,\"Freilos\",IF(E52=\"Freilos\",E52,IF(D52=\"Freilos\",D52,IF(F52>G52,E52,IF(G52>F52,D52,\"Verlierer 50\")))))))","v":"Verlierer 50"},null,null,null,null,null,null,null,"",0,0,0,0,0,0,0,0,{"$f":"IF(Auslosung_Turnierdaten!F22=\"\",\"\",14)","v":""},{"$f":"IF('SP64'!V81=\"\",\"\",Auslosung_Turnierdaten!F22)","v":""},{"$f":"IF('SP64'!V81=\"\",\"\",Auslosung_Turnierdaten!G22)","v":""},{"$f":"IF('SP64'!V81=\"\",\"\",Auslosung_Turnierdaten!H22)","v":""},{"$f":"IF('SP64'!V81=\"\",\"\",Auslosung_Turnierdaten!I22)","v":""},{"$f":"IF('SP64'!V81=\"\",\"\",'SP64'!X16)","v":""},{"$f":"IF('SP64'!V81=\"\",\"\",'SP64'!Z16)","v":""},{"$f":"IF('SP64'!V81=\"\",\"\",'SP64'!AA16)","v":""},{"$f":"IF('SP64'!V81=\"\",\"\",'SP64'!AC16)","v":""},{"$f":"IF('SP64'!V81=\"\",\"\",IF($AE$67=\"VSp\",'SP64'!AD16,'SP64'!AF16))","v":""},{"$f":"IF('SP64'!V81=\"\",\"\",IF($AF$67=\"Quot\",'SP64'!AE16,'SP64'!AG16))","v":""},{"$f":"IF($AG$67=\"BED\",'SP64'!AH16,\"\")","v":""},{"$f":"IF($AH$67=\"HS\",'SP64'!AI16,\"\")","v":""},null,null,null,null,null,null,null,0,{"$f":"IF(AND(COUNTIF(L81:L81:$L$129,L81)=1,F81+G81>0),L81 & \"-\",\"\")","v":""},"",null,null,""]
[null,null,80,{"$f":"IF(D50=\"Verlierer 31\",\"Sieger 48\",IF(E50=\"Verlierer 32\",\"Sieger 48\",IF(D50=E50,\"Freilos\",IF(E50=\"Freilos\",D50,IF(D50=\"Freilos\",E50,IF(F50>G50,D50,IF(G50>F50,E50,\"Sieger 48\")))))))","v":"Sieger 48"},{"$f":"IF(D51=\"Sieger 1\",\"Verlierer 49\",IF(E51=\"Sieger 2\",\"Verlierer 49\",IF(D51=E51,\"Freilos\",IF(E51=\"Freilos\",E51,IF(D51=\"Freilos\",D51,IF(F51>G51,E51,IF(G51>F51,D51,\"Verlierer 49\")))))))","v":"Verlierer 49"},null,null,null,null,null,null,null,"",0,0,0,0,0,0,0,0,{"$f":"IF(Auslosung_Turnierdaten!F23=\"\",\"\",15)","v":""},{"$f":"IF('SP64'!V82=\"\",\"\",Auslosung_Turnierdaten!F23)","v":""},{"$f":"IF('SP64'!V82=\"\",\"\",Auslosung_Turnierdaten!G23)","v":""},{"$f":"IF('SP64'!V82=\"\",\"\",Auslosung_Turnierdaten!H23)","v":""},{"$f":"IF('SP64'!V82=\"\",\"\",Auslosung_Turnierdaten!I23)","v":""},{"$f":"IF('SP64'!V82=\"\",\"\",'SP64'!X17)","v":""},{"$f":"IF('SP64'!V82=\"\",\"\",'SP64'!Z17)","v":""},{"$f":"IF('SP64'!V82=\"\",\"\",'SP64'!AA17)","v":""},{"$f":"IF('SP64'!V82=\"\",\"\",'SP64'!AC17)","v":""},{"$f":"IF('SP64'!V82=\"\",\"\",IF($AE$67=\"VSp\",'SP64'!AD17,'SP64'!AF17))","v":""},{"$f":"IF('SP64'!V82=\"\",\"\",IF($AF$67=\"Quot\",'SP64'!AE17,'SP64'!AG17))","v":""},{"$f":"IF($AG$67=\"BED\",'SP64'!AH17,\"\")","v":""},{"$f":"IF($AH$67=\"HS\",'SP64'!AI17,\"\")","v":""},null,null,null,null,null,null,null,0,{"$f":"IF(AND(COUNTIF(L82:L82:$L$129,L82)=1,F82+G82>0),L82 & \"-\",\"\")","v":""},"",null,null,""]
[null,"VR3",81,{"$f":"IF(D67=\"Sieger 33\",\"Sieger 65\",IF(E67=\"Verlierer 64\",\"Sieger 65\",IF(D67=E67,\"Freilos\",IF(E67=\"Freilos\",D67,IF(D67=\"Freilos\",E67,IF(F67>G67,D67,IF(G67>F67,E67,\"Sieger 65\")))))))","v":"Sieger 65"},{"$f":"IF(D68=\"Sieger 34\",\"Sieger 66\",IF(E68=\"Verlierer 63\",\"Sieger 66\",IF(D68=E68,\"Freilos\",IF(E68=\"Freilos\",D68,IF(D68=\"Freilos\",E68,IF(F68>G68,D68,IF(G68>F68,E68,\"Sieger 66\")))))))","v":"Sieger 66"},null,null,null,null,null,null,null,{"$f":"IF(F83>G83,E83,IF(G83>F83,D83,\"\"))","v":""},0,0,0,0,0,0,0,0,{"$f":"IF(Auslosung_Turnierdaten!F24=\"\",\"\",16)","v":""},{"$f":"IF('SP64'!V83=\"\",\"\",Auslosung_Turnierdaten!F24)","v":""},{"$f":"IF('SP64'!V83=\"\",\"\",Auslosung_Turnierdaten!G24)","v":""},{"$f":"IF('SP64'!V83=\"\",\"\",Auslosung_Turnierdaten!H24)","v":""},{"$f":"IF('SP64'!V83=\"\",\"\",Auslosung_Turnierdaten!I24)","v":""},{"$f":"IF('SP64'!V83=\"\",\"\",'SP64'!X18)","v":""},{"$f":"IF('SP64'!V83=\"\",\"\",'SP64'!Z18)","v":""},{"$f":"IF('SP64'!V83=\"\",\"\",'SP64'!AA18)","v":""},{"$f":"IF('SP64'!V83=\"\",\"\",'SP64'!AC18)","v":""},{"$f":"IF('SP64'!V83=\"\",\"\",IF($AE$67=\"VSp\",'SP64'!AD18,'SP64'!AF18))","v":""},{"$f":"IF('SP64'!V83=\"\",\"\",IF($AF$67=\"Quot\",'SP64'!AE18,'SP64'!AG18))","v":""},{"$f":"IF($AG$67=\"BED\",'SP64'!AH18,\"\")","v":""},{"$f":"IF($AH$67=\"HS\",'SP64'!AI18,\"\")","v":""},null,null,null,null,null,null,null,0,{"$f":"IF(AND(COUNTIF(L83:L83:$L$129,L83)=1,F83+G83>0),L83 & \"-\",\"\")","v":""},"",null,null,""]
[null,null,82,{"$f":"IF(D69=\"Sieger 35\",\"Sieger 67\",IF(E69=\"Verlierer 62\",\"Sieger 67\",IF(D69=E69,\"Freilos\",IF(E69=\"Freilos\",D69,IF(D69=\"Freilos\",E69,IF(F69>G69,D69,IF(G69>F69,E69,\"Sieger 67\")))))))","v":"Sieger 67"},{"$f":"IF(D70=\"Sieger 36\",\"Sieger 68\",IF(E70=\"Verlierer 61\",\"Sieger 68\",IF(D70=E70,\"Freilos\",IF(E70=\"Freilos\",D70,IF(D70=\"Freilos\",E70,IF(F70>G70,D70,IF(G70>F70,E70,\"Sieger 68\")))))))","v":"Sieger 68"},null,null,null,null,null,null,null,{"$f":"IF(F84>G84,E84,IF(G84>F84,D84,\"\"))","v":""},0,0,0,0,0,0,0,0,{"$f":"IF(Auslosung_Turnierdaten!F25=\"\",\"\",17)","v":""},{"$f":"IF('SP64'!V84=\"\",\"\",Auslosung_Turnierdaten!F25)","v":""},{"$f":"IF('SP64'!V84=\"\",\"\",Auslosung_Turnierdaten!G25)","v":""},{"$f":"IF('SP64'!V84=\"\",\"\",Auslosung_Turnierdaten!H25)","v":""},{"$f":"IF('SP64'!V84=\"\",\"\",Auslosung_Turnierdaten!I25)","v":""},{"$f":"IF('SP64'!V84=\"\",\"\",'SP64'!X19)","v":""},{"$f":"IF('SP64'!V84=\"\",\"\",'SP64'!Z19)","v":""},{"$f":"IF('SP64'!V84=\"\",\"\",'SP64'!AA19)","v":""},{"$f":"IF('SP64'!V84=\"\",\"\",'SP64'!AC19)","v":""},{"$f":"IF('SP64'!V84=\"\",\"\",IF($AE$67=\"VSp\",'SP64'!AD19,'SP64'!AF19))","v":""},{"$f":"IF('SP64'!V84=\"\",\"\",IF($AF$67=\"Quot\",'SP64'!AE19,'SP64'!AG19))","v":""},{"$f":"IF($AG$67=\"BED\",'SP64'!AH19,\"\")","v":""},{"$f":"IF($AH$67=\"HS\",'SP64'!AI19,\"\")","v":""},null,null,null,null,null,null,null,0,{"$f":"IF(AND(COUNTIF(L84:L84:$L$129,L84)=1,F84+G84>0),L84 & \"-\",\"\")","v":""},"",null,null,""]
[null,null,83,{"$f":"IF(D71=\"Sieger 37\",\"Sieger 69\",IF(E71=\"Verlierer 60\",\"Sieger 69\",IF(D71=E71,\"Freilos\",IF(E71=\"Freilos\",D71,IF(D71=\"Freilos\",E71,IF(F71>G71,D71,IF(G71>F71,E71,\"Sieger 69\")))))))","v":"Sieger 69"},{"$f":"IF(D72=\"Sieger 38\",\"Sieger 70\",IF(E72=\"Verlierer 59\",\"Sieger 70\",IF(D72=E72,\"Freilos\",IF(E72=\"Freilos\",D72,IF(D72=\"Freilos\",E72,IF(F72>G72,D72,IF(G72>F72,E72,\"Sieger 70\")))))))","v":"Sieger 70"},null,null,null,null,null,null,null,"",0,0,0,0,0,0,0,0,{"$f":"IF(Auslosung_Turnierdaten!F26=\"\",\"\",18)","v":""},{"$f":"IF('SP64'!V85=\"\",\"\",Auslosung_Turnierdaten!F26)","v":""},{"$f":"IF('SP64'!V85=\"\",\"\",Auslosung_Turnierdaten!G26)","v":""},{"$f":"IF('SP64'!V85=\"\",\"\",Auslosung_Turnierdaten!H26)","v":""},{"$f":"IF('SP64'!V85=\"\",\"\",Auslosung_Turnierdaten!I26)","v":""},{"$f":"IF('SP64'!V85=\"\",\"\",'SP64'!X20)","v":""},{"$f":"IF('SP64'!V85=\"\",\"\",'SP64'!Z20)","v":""},{"$f":"IF('SP64'!V85=\"\",\"\",'SP64'!AA20)","v":""},{"$f":"IF('SP64'!V85=\"\",\"\",'SP64'!AC20)","v":""},{"$f":"IF('SP64'!V85=\"\",\"\",IF($AE$67=\"VSp\",'SP64'!AD20,'SP64'!AF20))","v":""},{"$f":"IF('SP64'!V85=\"\",\"\",IF($AF$67=\"Quot\",'SP64'!AE20,'SP64'!AG20))","v":""},{"$f":"IF($AG$67=\"BED\",'SP64'!AH20,\"\")","v":""},{"$f":"IF($AH$67=\"HS\",'SP64'!AI20,\"\")","v":""},null,null,null,null,null,null,null,0,{"$f":"IF(AND(COUNTIF(L85:L85:$L$129,L85)=1,F85+G85>0),L85 & \"-\",\"\")","v":""},"",null,null,""]
[null,null,84,{"$f":"IF(D73=\"Sieger 39\",\"Sieger 71\",IF(E73=\"Verlierer 58\",\"Sieger 71\",IF(D73=E73,\"Freilos\",IF(E73=\"Freilos\",D73,IF(D73=\"Freilos\",E73,IF(F73>G73,D73,IF(G73>F73,E73,\"Sieger 71\")))))))","v":"Sieger 71"},{"$f":"IF(D74=\"Sieger 40\",\"Sieger 72\",IF(E74=\"Verlierer 57\",\"Sieger 72\",IF(D74=E74,\"Freilos\",IF(E74=\"Freilos\",D74,IF(D74=\"Freilos\",E74,IF(F74>G74,D74,IF(G74>F74,E74,\"Sieger 72\")))))))","v":"Sieger 72"},null,null,null,null,null,null,null,"",0,0,0,0,0,0,0,0,{"$f":"IF(Auslosung_Turnierdaten!F27=\"\",\"\",19)","v":""},{"$f":"IF('SP64'!V86=\"\",\"\",Auslosung_Turnierdaten!F27)","v":""},{"$f":"IF('SP64'!V86=\"\",\"\",Auslosung_Turnierdaten!G27)","v":""},{"$f":"IF('SP64'!V86=\"\",\"\",Auslosung_Turnierdaten!H27)","v":""},{"$f":"IF('SP64'!V86=\"\",\"\",Auslosung_Turnierdaten!I27)","v":""},{"$f":"IF('SP64'!V86=\"\",\"\",'SP64'!X21)","v":""},{"$f":"IF('SP64'!V86=\"\",\"\",'SP64'!Z21)","v":""},{"$f":"IF('SP64'!V86=\"\",\"\",'SP64'!AA21)","v":""},{"$f":"IF('SP64'!V86=\"\",\"\",'SP64'!AC21)","v":""},{"$f":"IF('SP64'!V86=\"\",\"\",IF($AE$67=\"VSp\",'SP64'!AD21,'SP64'!AF21))","v":""},{"$f":"IF('SP64'!V86=\"\",\"\",IF($AF$67=\"Quot\",'SP64'!AE21,'SP64'!AG21))","v":""},{"$f":"IF($AG$67=\"BED\",'SP64'!AH21,\"\")","v":""},{"$f":"IF($AH$67=\"HS\",'SP64'!AI21,\"\")","v":""},null,null,null,null,null,null,null,0,{"$f":"IF(AND(COUNTIF(L86:L86:$L$129,L86)=1,F86+G86>0),L86 & \"-\",\"\")","v":""},"",null,null,""]
[null,null,85,{"$f":"IF(D75=\"Sieger 41\",\"Sieger 73\",IF(E75=\"Verlierer 56\",\"Sieger 73\",IF(D75=E75,\"Freilos\",IF(E75=\"Freilos\",D75,IF(D75=\"Freilos\",E75,IF(F75>G75,D75,IF(G75>F75,E75,\"Sieger 73\")))))))","v":"Sieger 73"},{"$f":"IF(D76=\"Sieger 42\",\"Sieger 74\",IF(E76=\"Verlierer 55\",\"Sieger 74\",IF(D76=E76,\"Freilos\",IF(E76=\"Freilos\",D76,IF(D76=\"Freilos\",E76,IF(F76>G76,D76,IF(G76>F76,E76,\"Sieger 74\")))))))","v":"Sieger 74"},null,null,null,null,null,null,null,"",0,0,0,0,0,0,0,0,{"$f":"IF(Auslosung_Turnierdaten!F28=\"\",\"\",20)","v":""},{"$f":"IF('SP64'!V87=\"\",\"\",Auslosung_Turnierdaten!F28)","v":""},{"$f":"IF('SP64'!V87=\"\",\"\",Auslosung_Turnierdaten!G28)","v":""},{"$f":"IF('SP64'!V87=\"\",\"\",Auslosung_Turnierdaten!H28)","v":""},{"$f":"IF('SP64'!V87=\"\",\"\",Auslosung_Turnierdaten!I28)","v":""},{"$f":"IF('SP64'!V87=\"\",\"\",'SP64'!X22)","v":""},{"$f":"IF('SP64'!V87=\"\",\"\",'SP64'!Z22)","v":""},{"$f":"IF('SP64'!V87=\"\",\"\",'SP64'!AA22)","v":""},{"$f":"IF('SP64'!V87=\"\",\"\",'SP64'!AC22)","v":""},{"$f":"IF('SP64'!V87=\"\",\"\",IF($AE$67=\"VSp\",'SP64'!AD22,'SP64'!AF22))","v":""},{"$f":"IF('SP64'!V87=\"\",\"\",IF($AF$67=\"Quot\",'SP64'!AE22,'SP64'!AG22))","v":""},{"$f":"IF($AG$67=\"BED\",'SP64'!AH22,\"\")","v":""},{"$f":"IF($AH$67=\"HS\",'SP64'!AI22,\"\")","v":""},null,null,null,null,null,null,null,0,{"$f":"IF(AND(COUNTIF(L87:L87:$L$129,L87)=1,F87+G87>0),L87 & \"-\",\"\")","v":""},"",null,null,""]
[null,null,86,{"$f":"IF(D77=\"Sieger 43\",\"Sieger 75\",IF(E77=\"Verlierer 54\",\"Sieger 75\",IF(D77=E77,\"Freilos\",IF(E77=\"Freilos\",D77,IF(D77=\"Freilos\",E77,IF(F77>G77,D77,IF(G77>F77,E77,\"Sieger 75\")))))))","v":"Sieger 75"},{"$f":"IF(D78=\"Sieger 44\",\"Sieger 76\",IF(E78=\"Verlierer 53\",\"Sieger 76\",IF(D78=E78,\"Freilos\",IF(E78=\"Freilos\",D78,IF(D78=\"Freilos\",E78,IF(F78>G78,D78,IF(G78>F78,E78,\"Sieger 76\")))))))","v":"Sieger 76"},null,null,null,null,null,null,null,"",0,0,0,0,0,0,0,0,{"$f":"IF(Auslosung_Turnierdaten!F29=\"\",\"\",21)","v":""},{"$f":"IF('SP64'!V88=\"\",\"\",Auslosung_Turnierdaten!F29)","v":""},{"$f":"IF('SP64'!V88=\"\",\"\",Auslosung_Turnierdaten!G29)","v":""},{"$f":"IF('SP64'!V88=\"\",\"\",Auslosung_Turnierdaten!H29)","v":""},{"$f":"IF('SP64'!V88=\"\",\"\",Auslosung_Turnierdaten!I29)","v":""},{"$f":"IF('SP64'!V88=\"\",\"\",'SP64'!X23)","v":""},{"$f":"IF('SP64'!V88=\"\",\"\",'SP64'!Z23)","v":""},{"$f":"IF('SP64'!V88=\"\",\"\",'SP64'!AA23)","v":""},{"$f":"IF('SP64'!V88=\"\",\"\",'SP64'!AC23)","v":""},{"$f":"IF('SP64'!V88=\"\",\"\",IF($AE$67=\"VSp\",'SP64'!AD23,'SP64'!AF23))","v":""},{"$f":"IF('SP64'!V88=\"\",\"\",IF($AF$67=\"Quot\",'SP64'!AE23,'SP64'!AG23))","v":""},{"$f":"IF($AG$67=\"BED\",'SP64'!AH23,\"\")","v":""},{"$f":"IF($AH$67=\"HS\",'SP64'!AI23,\"\")","v":""},null,null,null,null,null,null,null,0,{"$f":"IF(AND(COUNTIF(L88:L88:$L$129,L88)=1,F88+G88>0),L88 & \"-\",\"\")","v":""},"",null,null,""]
[null,null,87,{"$f":"IF(D79=\"Sieger 45\",\"Sieger 77\",IF(E79=\"Verlierer 52\",\"Sieger 77\",IF(D79=E79,\"Freilos\",IF(E79=\"Freilos\",D79,IF(D79=\"Freilos\",E79,IF(F79>G79,D79,IF(G79>F79,E79,\"Sieger 77\")))))))","v":"Sieger 77"},{"$f":"IF(D80=\"Sieger 46\",\"Sieger 78\",IF(E80=\"Verlierer 51\",\"Sieger 78\",IF(D80=E80,\"Freilos\",IF(E80=\"Freilos\",D80,IF(D80=\"Freilos\",E80,IF(F80>G80,D80,IF(G80>F80,E80,\"Sieger 78\")))))))","v":"Sieger 78"},null,null,null,null,null,null,null,"",0,0,0,0,0,0,0,0,{"$f":"IF(Auslosung_Turnierdaten!F30=\"\",\"\",22)","v":""},{"$f":"IF('SP64'!V89=\"\",\"\",Auslosung_Turnierdaten!F30)","v":""},{"$f":"IF('SP64'!V89=\"\",\"\",Auslosung_Turnierdaten!G30)","v":""},{"$f":"IF('SP64'!V89=\"\",\"\",Auslosung_Turnierdaten!H30)","v":""},{"$f":"IF('SP64'!V89=\"\",\"\",Auslosung_Turnierdaten!I30)","v":""},{"$f":"IF('SP64'!V89=\"\",\"\",'SP64'!X24)","v":""},{"$f":"IF('SP64'!V89=\"\",\"\",'SP64'!Z24)","v":""},{"$f":"IF('SP64'!V89=\"\",\"\",'SP64'!AA24)","v":""},{"$f":"IF('SP64'!V89=\"\",\"\",'SP64'!AC24)","v":""},{"$f":"IF('SP64'!V89=\"\",\"\",IF($AE$67=\"VSp\",'SP64'!AD24,'SP64'!AF24))","v":""},{"$f":"IF('SP64'!V89=\"\",\"\",IF($AF$67=\"Quot\",'SP64'!AE24,'SP64'!AG24))","v":""},{"$f":"IF($AG$67=\"BED\",'SP64'!AH24,\"\")","v":""},{"$f":"IF($AH$67=\"HS\",'SP64'!AI24,\"\")","v":""},null,null,null,null,null,null,null,0,{"$f":"IF(AND(COUNTIF(L89:L89:$L$129,L89)=1,F89+G89>0),L89 & \"-\",\"\")","v":""},"",null,null,""]
[null,null,88,{"$f":"IF(D81=\"Sieger 47\",\"Sieger 79\",IF(E81=\"Verlierer 50\",\"Sieger 79\",IF(D81=E81,\"Freilos\",IF(E81=\"Freilos\",D81,IF(D81=\"Freilos\",E81,IF(F81>G81,D81,IF(G81>F81,E81,\"Sieger 79\")))))))","v":"Sieger 79"},{"$f":"IF(D82=\"Sieger 48\",\"Sieger 80\",IF(E82=\"Verlierer 49\",\"Sieger 80\",IF(D82=E82,\"Freilos\",IF(E82=\"Freilos\",D82,IF(D82=\"Freilos\",E82,IF(F82>G82,D82,IF(G82>F82,E82,\"Sieger 80\")))))))","v":"Sieger 80"},null,null,null,null,null,null,null,"",0,0,0,0,0,0,0,0,{"$f":"IF(Auslosung_Turnierdaten!F31=\"\",\"\",23)","v":""},{"$f":"IF('SP64'!V90=\"\",\"\",Auslosung_Turnierdaten!F31)","v":""},{"$f":"IF('SP64'!V90=\"\",\"\",Auslosung_Turnierdaten!G31)","v":""},{"$f":"IF('SP64'!V90=\"\",\"\",Auslosung_Turnierdaten!H31)","v":""},{"$f":"IF('SP64'!V90=\"\",\"\",Auslosung_Turnierdaten!I31)","v":""},{"$f":"IF('SP64'!V90=\"\",\"\",'SP64'!X25)","v":""},{"$f":"IF('SP64'!V90=\"\",\"\",'SP64'!Z25)","v":""},{"$f":"IF('SP64'!V90=\"\",\"\",'SP64'!AA25)","v":""},{"$f":"IF('SP64'!V90=\"\",\"\",'SP64'!AC25)","v":""},{"$f":"IF('SP64'!V90=\"\",\"\",IF($AE$67=\"VSp\",'SP64'!AD25,'SP64'!AF25))","v":""},{"$f":"IF('SP64'!V90=\"\",\"\",IF($AF$67=\"Quot\",'SP64'!AE25,'SP64'!AG25))","v":""},{"$f":"IF($AG$67=\"BED\",'SP64'!AH25,\"\")","v":""},{"$f":"IF($AH$67=\"HS\",'SP64'!AI25,\"\")","v":""},null,null,null,null,null,null,null,0,{"$f":"IF(AND(COUNTIF(L90:L90:$L$129,L90)=1,F90+G90>0),L90 & \"-\",\"\")","v":""},"",null,null,""]
[null,"GR2",89,{"$f":"IF(D51=\"Sieger 1\",\"Sieger 49\",IF(E51=\"Sieger 2\",\"Sieger 49\",IF(D51=E51,\"Freilos\",IF(E51=\"Freilos\",D51,IF(D51=\"Freilos\",E51,IF(F51>G51,D51,IF(G51>F51,E51,\"Sieger 49\")))))))","v":"Sieger 49"},{"$f":"IF(D52=\"Sieger 3\",\"Sieger 50\",IF(E52=\"Sieger 4\",\"Sieger 50\",IF(D52=E52,\"Freilos\",IF(E52=\"Freilos\",D52,IF(D52=\"Freilos\",E52,IF(F52>G52,D52,IF(G52>F52,E52,\"Sieger 50\")))))))","v":"Sieger 50"},null,null,null,null,null,null,null,null,0,0,0,0,0,0,{"$f":"IF(E91=\"Freilos\",6,IF(F91>G91,6,0))","v":0},{"$f":"IF(D91=\"Freilos\",6,IF(G91>F91,6,0))","v":0},{"$f":"IF(Auslosung_Turnierdaten!F32=\"\",\"\",24)","v":""},{"$f":"IF('SP64'!V91=\"\",\"\",Auslosung_Turnierdaten!F32)","v":""},{"$f":"IF('SP64'!V91=\"\",\"\",Auslosung_Turnierdaten!G32)","v":""},{"$f":"IF('SP64'!V91=\"\",\"\",Auslosung_Turnierdaten!H32)","v":""},{"$f":"IF('SP64'!V91=\"\",\"\",Auslosung_Turnierdaten!I32)","v":""},{"$f":"IF('SP64'!V91=\"\",\"\",'SP64'!X26)","v":""},{"$f":"IF('SP64'!V91=\"\",\"\",'SP64'!Z26)","v":""},{"$f":"IF('SP64'!V91=\"\",\"\",'SP64'!AA26)","v":""},{"$f":"IF('SP64'!V91=\"\",\"\",'SP64'!AC26)","v":""},{"$f":"IF('SP64'!V91=\"\",\"\",IF($AE$67=\"VSp\",'SP64'!AD26,'SP64'!AF26))","v":""},{"$f":"IF('SP64'!V91=\"\",\"\",IF($AF$67=\"Quot\",'SP64'!AE26,'SP64'!AG26))","v":""},{"$f":"IF($AG$67=\"BED\",'SP64'!AH26,\"\")","v":""},{"$f":"IF($AH$67=\"HS\",'SP64'!AI26,\"\")","v":""},null,null,null,null,null,null,null,0,{"$f":"IF(AND(COUNTIF(L91:L91:$L$129,L91)=1,F91+G91>0),L91 & \"-\",\"\")","v":""},"",null,null,""]
[null,null,90,{"$f":"IF(D53=\"Sieger 5\",\"Sieger 51\",IF(E53=\"Sieger 6\",\"Sieger 51\",IF(D53=E53,\"Freilos\",IF(E53=\"Freilos\",D53,IF(D53=\"Freilos\",E53,IF(F53>G53,D53,IF(G53>F53,E53,\"Sieger 51\")))))))","v":"Sieger 51"},{"$f":"IF(D54=\"Sieger 7\",\"Sieger 52\",IF(E54=\"Sieger 8\",\"Sieger 52\",IF(D54=E54,\"Freilos\",IF(E54=\"Freilos\",D54,IF(D54=\"Freilos\",E54,IF(F54>G54,D54,IF(G54>F54,E54,\"Sieger 52\")))))))","v":"Sieger 52"},null,null,null,null,null,null,null,null,0,0,0,0,0,0,{"$f":"IF(E92=\"Freilos\",6,IF(F92>G92,6,0))","v":0},{"$f":"IF(D92=\"Freilos\",6,IF(G92>F92,6,0))","v":0},{"$f":"IF(Auslosung_Turnierdaten!F33=\"\",\"\",25)","v":""},{"$f":"IF('SP64'!V92=\"\",\"\",Auslosung_Turnierdaten!F33)","v":""},{"$f":"IF('SP64'!V92=\"\",\"\",Auslosung_Turnierdaten!G33)","v":""},{"$f":"IF('SP64'!V92=\"\",\"\",Auslosung_Turnierdaten!H33)","v":""},{"$f":"IF('SP64'!V92=\"\",\"\",Auslosung_Turnierdaten!I33)","v":""},{"$f":"IF('SP64'!V92=\"\",\"\",'SP64'!X27)","v":""},{"$f":"IF('SP64'!V92=\"\",\"\",'SP64'!Z27)","v":""},{"$f":"IF('SP64'!V92=\"\",\"\",'SP64'!AA27)","v":""},{"$f":"IF('SP64'!V92=\"\",\"\",'SP64'!AC27)","v":""},{"$f":"IF('SP64'!V92=\"\",\"\",IF($AE$67=\"VSp\",'SP64'!AD27,'SP64'!AF27))","v":""},{"$f":"IF('SP64'!V92=\"\",\"\",IF($AF$67=\"Quot\",'SP64'!AE27,'SP64'!AG27))","v":""},{"$f":"IF($AG$67=\"BED\",'SP64'!AH27,\"\")","v":""},{"$f":"IF($AH$67=\"HS\",'SP64'!AI27,\"\")","v":""},null,null,null,null,null,null,null,0,{"$f":"IF(AND(COUNTIF(L92:L92:$L$129,L92)=1,F92+G92>0),L92 & \"-\",\"\")","v":""},"",null,null,""]
[null,null,91,{"$f":"IF(D55=\"Sieger 9\",\"Sieger 53\",IF(E55=\"Sieger 10\",\"Sieger 53\",IF(D55=E55,\"Freilos\",IF(E55=\"Freilos\",D55,IF(D55=\"Freilos\",E55,IF(F55>G55,D55,IF(G55>F55,E55,\"Sieger 53\")))))))","v":"Sieger 53"},{"$f":"IF(D56=\"Sieger 11\",\"Sieger 54\",IF(E56=\"Sieger 12\",\"Sieger 54\",IF(D56=E56,\"Freilos\",IF(E56=\"Freilos\",D56,IF(D56=\"Freilos\",E56,IF(F56>G56,D56,IF(G56>F56,E56,\"Sieger 54\")))))))","v":"Sieger 54"},null,null,null,null,null,null,null,null,0,0,0,0,0,0,0,0,{"$f":"IF(Auslosung_Turnierdaten!F34=\"\",\"\",26)","v":""},{"$f":"IF('SP64'!V93=\"\",\"\",Auslosung_Turnierdaten!F34)","v":""},{"$f":"IF('SP64'!V93=\"\",\"\",Auslosung_Turnierdaten!G34)","v":""},{"$f":"IF('SP64'!V93=\"\",\"\",Auslosung_Turnierdaten!H34)","v":""},{"$f":"IF('SP64'!V93=\"\",\"\",Auslosung_Turnierdaten!I34)","v":""},{"$f":"IF('SP64'!V93=\"\",\"\",'SP64'!X28)","v":""},{"$f":"IF('SP64'!V93=\"\",\"\",'SP64'!Z28)","v":""},{"$f":"IF('SP64'!V93=\"\",\"\",'SP64'!AA28)","v":""},{"$f":"IF('SP64'!V93=\"\",\"\",'SP64'!AC28)","v":""},{"$f":"IF('SP64'!V93=\"\",\"\",IF($AE$67=\"VSp\",'SP64'!AD28,'SP64'!AF28))","v":""},{"$f":"IF('SP64'!V93=\"\",\"\",IF($AF$67=\"Quot\",'SP64'!AE28,'SP64'!AG28))","v":""},{"$f":"IF($AG$67=\"BED\",'SP64'!AH28,\"\")","v":""},{"$f":"IF($AH$67=\"HS\",'SP64'!AI28,\"\")","v":""},null,null,null,null,null,null,null,0,{"$f":"IF(AND(COUNTIF(L93:L93:$L$129,L93)=1,F93+G93>0),L93 & \"-\",\"\")","v":""},"",null,null,""]
[null,null,92,{"$f":"IF(D57=\"Sieger 13\",\"Sieger 55\",IF(E57=\"Sieger 14\",\"Sieger 55\",IF(D57=E57,\"Freilos\",IF(E57=\"Freilos\",D57,IF(D57=\"Freilos\",E57,IF(F57>G57,D57,IF(G57>F57,E57,\"Sieger 55\")))))))","v":"Sieger 55"},{"$f":"IF(D58=\"Sieger 15\",\"Sieger 56\",IF(E58=\"Sieger 16\",\"Sieger 56\",IF(D58=E58,\"Freilos\",IF(E58=\"Freilos\",D58,IF(D58=\"Freilos\",E58,IF(F58>G58,D58,IF(G58>F58,E58,\"Sieger 56\")))))))","v":"Sieger 56"},null,null,null,null,null,null,null,null,0,0,0,0,0,0,0,0,{"$f":"IF(Auslosung_Turnierdaten!F35=\"\",\"\",27)","v":""},{"$f":"IF('SP64'!V94=\"\",\"\",Auslosung_Turnierdaten!F35)","v":""},{"$f":"IF('SP64'!V94=\"\",\"\",Auslosung_Turnierdaten!G35)","v":""},{"$f":"IF('SP64'!V94=\"\",\"\",Auslosung_Turnierdaten!H35)","v":""},{"$f":"IF('SP64'!V94=\"\",\"\",Auslosung_Turnierdaten!I35)","v":""},{"$f":"IF('SP64'!V94=\"\",\"\",'SP64'!X29)","v":""},{"$f":"IF('SP64'!V94=\"\",\"\",'SP64'!Z29)","v":""},{"$f":"IF('SP64'!V94=\"\",\"\",'SP64'!AA29)","v":""},{"$f":"IF('SP64'!V94=\"\",\"\",'SP64'!AC29)","v":""},{"$f":"IF('SP64'!V94=\"\",\"\",IF($AE$67=\"VSp\",'SP64'!AD29,'SP64'!AF29))","v":""},{"$f":"IF('SP64'!V94=\"\",\"\",IF($AF$67=\"Quot\",'SP64'!AE29,'SP64'!AG29))","v":""},{"$f":"IF($AG$67=\"BED\",'SP64'!AH29,\"\")","v":""},{"$f":"IF($AH$67=\"HS\",'SP64'!AI29,\"\")","v":""},null,null,null,null,null,null,null,0,{"$f":"IF(AND(COUNTIF(L94:L94:$L$129,L94)=1,F94+G94>0),L94 & \"-\",\"\")","v":""},"",null,null,""]
[null,null,93,{"$f":"IF(D59=\"Sieger 17\",\"Sieger 57\",IF(E59=\"Sieger 18\",\"Sieger 57\",IF(D59=E59,\"Freilos\",IF(E59=\"Freilos\",D59,IF(D59=\"Freilos\",E59,IF(F59>G59,D59,IF(G59>F59,E59,\"Sieger 57\")))))))","v":"Sieger 57"},{"$f":"IF(D60=\"Sieger 19\",\"Sieger 58\",IF(E60=\"Sieger 20\",\"Sieger 58\",IF(D60=E60,\"Freilos\",IF(E60=\"Freilos\",D60,IF(D60=\"Freilos\",E60,IF(F60>G60,D60,IF(G60>F60,E60,\"Sieger 58\")))))))","v":"Sieger 58"},null,null,null,null,null,null,null,null,0,0,0,0,0,0,0,0,{"$f":"IF(Auslosung_Turnierdaten!F36=\"\",\"\",28)","v":""},{"$f":"IF('SP64'!V95=\"\",\"\",Auslosung_Turnierdaten!F36)","v":""},{"$f":"IF('SP64'!V95=\"\",\"\",Auslosung_Turnierdaten!G36)","v":""},{"$f":"IF('SP64'!V95=\"\",\"\",Auslosung_Turnierdaten!H36)","v":""},{"$f":"IF('SP64'!V95=\"\",\"\",Auslosung_Turnierdaten!I36)","v":""},{"$f":"IF('SP64'!V95=\"\",\"\",'SP64'!X30)","v":""},{"$f":"IF('SP64'!V95=\"\",\"\",'SP64'!Z30)","v":""},{"$f":"IF('SP64'!V95=\"\",\"\",'SP64'!AA30)","v":""},{"$f":"IF('SP64'!V95=\"\",\"\",'SP64'!AC30)","v":""},{"$f":"IF('SP64'!V95=\"\",\"\",IF($AE$67=\"VSp\",'SP64'!AD30,'SP64'!AF30))","v":""},{"$f":"IF('SP64'!V95=\"\",\"\",IF($AF$67=\"Quot\",'SP64'!AE30,'SP64'!AG30))","v":""},{"$f":"IF($AG$67=\"BED\",'SP64'!AH30,\"\")","v":""},{"$f":"IF($AH$67=\"HS\",'SP64'!AI30,\"\")","v":""},null,null,null,null,null,null,null,0,{"$f":"IF(AND(COUNTIF(L95:L95:$L$129,L95)=1,F95+G95>0),L95 & \"-\",\"\")","v":""},"",null,null,""]
[null,null,94,{"$f":"IF(D61=\"Sieger 21\",\"Sieger 59\",IF(E61=\"Sieger 22\",\"Sieger 59\",IF(D61=E61,\"Freilos\",IF(E61=\"Freilos\",D61,IF(D61=\"Freilos\",E61,IF(F61>G61,D61,IF(G61>F61,E61,\"Sieger 59\")))))))","v":"Sieger 59"},{"$f":"IF(D62=\"Sieger 23\",\"Sieger 60\",IF(E62=\"Sieger 24\",\"Sieger 60\",IF(D62=E62,\"Freilos\",IF(E62=\"Freilos\",D62,IF(D62=\"Freilos\",E62,IF(F62>G62,D62,IF(G62>F62,E62,\"Sieger 60\")))))))","v":"Sieger 60"},null,null,null,null,null,null,null,null,0,0,0,0,0,0,0,0,{"$f":"IF(Auslosung_Turnierdaten!F37=\"\",\"\",29)","v":""},{"$f":"IF('SP64'!V96=\"\",\"\",Auslosung_Turnierdaten!F37)","v":""},{"$f":"IF('SP64'!V96=\"\",\"\",Auslosung_Turnierdaten!G37)","v":""},{"$f":"IF('SP64'!V96=\"\",\"\",Auslosung_Turnierdaten!H37)","v":""},{"$f":"IF('SP64'!V96=\"\",\"\",Auslosung_Turnierdaten!I37)","v":""},{"$f":"IF('SP64'!V96=\"\",\"\",'SP64'!X31)","v":""},{"$f":"IF('SP64'!V96=\"\",\"\",'SP64'!Z31)","v":""},{"$f":"IF('SP64'!V96=\"\",\"\",'SP64'!AA31)","v":""},{"$f":"IF('SP64'!V96=\"\",\"\",'SP64'!AC31)","v":""},{"$f":"IF('SP64'!V96=\"\",\"\",IF($AE$67=\"VSp\",'SP64'!AD31,'SP64'!AF31))","v":""},{"$f":"IF('SP64'!V96=\"\",\"\",IF($AF$67=\"Quot\",'SP64'!AE31,'SP64'!AG31))","v":""},{"$f":"IF($AG$67=\"BED\",'SP64'!AH31,\"\")","v":""},{"$f":"IF($AH$67=\"HS\",'SP64'!AI31,\"\")","v":""},null,null,null,null,null,null,null,0,{"$f":"IF(AND(COUNTIF(L96:L96:$L$129,L96)=1,F96+G96>0),L96 & \"-\",\"\")","v":""},"",null,null,""]
[null,null,95,{"$f":"IF(D63=\"Sieger 25\",\"Sieger 61\",IF(E63=\"Sieger 26\",\"Sieger 61\",IF(D63=E63,\"Freilos\",IF(E63=\"Freilos\",D63,IF(D63=\"Freilos\",E63,IF(F63>G63,D63,IF(G63>F63,E63,\"Sieger 61\")))))))","v":"Sieger 61"},{"$f":"IF(D64=\"Sieger 27\",\"Sieger 62\",IF(E64=\"Sieger 28\",\"Sieger 62\",IF(D64=E64,\"Freilos\",IF(E64=\"Freilos\",D64,IF(D64=\"Freilos\",E64,IF(F64>G64,D64,IF(G64>F64,E64,\"Sieger 62\")))))))","v":"Sieger 62"},null,null,null,null,null,null,null,null,0,0,0,0,0,0,0,0,{"$f":"IF(Auslosung_Turnierdaten!F38=\"\",\"\",30)","v":""},{"$f":"IF('SP64'!V97=\"\",\"\",Auslosung_Turnierdaten!F38)","v":""},{"$f":"IF('SP64'!V97=\"\",\"\",Auslosung_Turnierdaten!G38)","v":""},{"$f":"IF('SP64'!V97=\"\",\"\",Auslosung_Turnierdaten!H38)","v":""},{"$f":"IF('SP64'!V97=\"\",\"\",Auslosung_Turnierdaten!I38)","v":""},{"$f":"IF('SP64'!V97=\"\",\"\",'SP64'!X32)","v":""},{"$f":"IF('SP64'!V97=\"\",\"\",'SP64'!Z32)","v":""},{"$f":"IF('SP64'!V97=\"\",\"\",'SP64'!AA32)","v":""},{"$f":"IF('SP64'!V97=\"\",\"\",'SP64'!AC32)","v":""},{"$f":"IF('SP64'!V97=\"\",\"\",IF($AE$67=\"VSp\",'SP64'!AD32,'SP64'!AF32))","v":""},{"$f":"IF('SP64'!V97=\"\",\"\",IF($AF$67=\"Quot\",'SP64'!AE32,'SP64'!AG32))","v":""},{"$f":"IF($AG$67=\"BED\",'SP64'!AH32,\"\")","v":""},{"$f":"IF($AH$67=\"HS\",'SP64'!AI32,\"\")","v":""},null,null,null,null,null,null,null,0,{"$f":"IF(AND(COUNTIF(L97:L97:$L$129,L97)=1,F97+G97>0),L97 & \"-\",\"\")","v":""},"",null,null,""]
[null,null,96,{"$f":"IF(D65=\"Sieger 29\",\"Sieger 63\",IF(E65=\"Sieger 30\",\"Sieger 63\",IF(D65=E65,\"Freilos\",IF(E65=\"Freilos\",D65,IF(D65=\"Freilos\",E65,IF(F65>G65,D65,IF(G65>F65,E65,\"Sieger 63\")))))))","v":"Sieger 63"},{"$f":"IF(D66=\"Sieger 31\",\"Sieger 64\",IF(E66=\"Sieger 32\",\"Sieger 64\",IF(D66=E66,\"Freilos\",IF(E66=\"Freilos\",D66,IF(D66=\"Freilos\",E66,IF(F66>G66,D66,IF(G66>F66,E66,\"Sieger 64\")))))))","v":"Sieger 64"},null,null,null,null,null,null,null,null,0,0,0,0,0,0,0,0,{"$f":"IF(Auslosung_Turnierdaten!F39=\"\",\"\",31)","v":""},{"$f":"IF('SP64'!V98=\"\",\"\",Auslosung_Turnierdaten!F39)","v":""},{"$f":"IF('SP64'!V98=\"\",\"\",Auslosung_Turnierdaten!G39)","v":""},{"$f":"IF('SP64'!V98=\"\",\"\",Auslosung_Turnierdaten!H39)","v":""},{"$f":"IF('SP64'!V98=\"\",\"\",Auslosung_Turnierdaten!I39)","v":""},{"$f":"IF('SP64'!V98=\"\",\"\",'SP64'!X33)","v":""},{"$f":"IF('SP64'!V98=\"\",\"\",'SP64'!Z33)","v":""},{"$f":"IF('SP64'!V98=\"\",\"\",'SP64'!AA33)","v":""},{"$f":"IF('SP64'!V98=\"\",\"\",'SP64'!AC33)","v":""},{"$f":"IF('SP64'!V98=\"\",\"\",IF($AE$67=\"VSp\",'SP64'!AD33,'SP64'!AF33))","v":""},{"$f":"IF('SP64'!V98=\"\",\"\",IF($AF$67=\"Quot\",'SP64'!AE33,'SP64'!AG33))","v":""},{"$f":"IF($AG$67=\"BED\",'SP64'!AH33,\"\")","v":""},{"$f":"IF($AH$67=\"HS\",'SP64'!AI33,\"\")","v":""},null,null,null,null,null,null,null,0,{"$f":"IF(AND(COUNTIF(L98:L98:$L$129,L98)=1,F98+G98>0),L98 & \"-\",\"\")","v":""},"",null,null,""]
[null,"VR4",97,{"$f":"IF(D83=\"Sieger 65\",\"Sieger 81\",IF(E83=\"Sieger 66\",\"Sieger 81\",IF(D83=E83,\"Freilos\",IF(E83=\"Freilos\",D83,IF(D83=\"Freilos\",E83,IF(F83>G83,D83,IF(G83>F83,E83,\"Sieger 81\")))))))","v":"Sieger 81"},{"$f":"IF(D94=\"Sieger 55\",\"Verlierer 92\",IF(E94=\"Sieger 56\",\"Verlierer 92\",IF(D94=E94,\"Freilos\",IF(D94=\"Freilos\",D94,IF(E94=\"Freilos\",E94,IF(F94>G94,E94,IF(G94>F94,D94,\"Verlierer 92\")))))))","v":"Verlierer 92"},null,null,null,null,null,null,null,{"$f":"IF(F99>G99,E99,IF(G99>F99,D99,\"\"))","v":""},0,0,0,0,0,0,0,0,{"$f":"IF(Auslosung_Turnierdaten!F40=\"\",\"\",32)","v":""},{"$f":"IF('SP64'!V99=\"\",\"\",Auslosung_Turnierdaten!F40)","v":""},{"$f":"IF('SP64'!V99=\"\",\"\",Auslosung_Turnierdaten!G40)","v":""},{"$f":"IF('SP64'!V99=\"\",\"\",Auslosung_Turnierdaten!H40)","v":""},{"$f":"IF('SP64'!V99=\"\",\"\",Auslosung_Turnierdaten!I40)","v":""},{"$f":"IF('SP64'!V99=\"\",\"\",'SP64'!X34)","v":""},{"$f":"IF('SP64'!V99=\"\",\"\",'SP64'!Z34)","v":""},{"$f":"IF('SP64'!V99=\"\",\"\",'SP64'!AA34)","v":""},{"$f":"IF('SP64'!V99=\"\",\"\",'SP64'!AC34)","v":""},{"$f":"IF('SP64'!V99=\"\",\"\",IF($AE$67=\"VSp\",'SP64'!AD34,'SP64'!AF34))","v":""},{"$f":"IF('SP64'!V99=\"\",\"\",IF($AF$67=\"Quot\",'SP64'!AE34,'SP64'!AG34))","v":""},{"$f":"IF($AG$67=\"BED\",'SP64'!AH34,\"\")","v":""},{"$f":"IF($AH$67=\"HS\",'SP64'!AI34,\"\")","v":""},null,null,null,null,null,null,null,0,{"$f":"IF(AND(COUNTIF(L99:L99:$L$129,L99)=1,F99+G99>0),L99 & \"-\",\"\")","v":""},"",null,null,""]
[null,null,98,{"$f":"IF(D84=\"Sieger 67\",\"Sieger 82\",IF(E84=\"Sieger 68\",\"Sieger 82\",IF(D84=E84,\"Freilos\",IF(E84=\"Freilos\",D84,IF(D84=\"Freilos\",E84,IF(F84>G84,D84,IF(G84>F84,E84,\"Sieger 82\")))))))","v":"Sieger 82"},{"$f":"IF(D93=\"Sieger 53\",\"Verlierer 91\",IF(E93=\"Sieger 54\",\"Verlierer 91\",IF(D93=E93,\"Freilos\",IF(D93=\"Freilos\",D93,IF(E93=\"Freilos\",E93,IF(F93>G93,E93,IF(G93>F93,D93,\"Verlierer 91\")))))))","v":"Verlierer 91"},null,null,null,null,null,null,null,"",0,0,0,0,0,0,0,0,{"$f":"IF(Auslosung_Turnierdaten!F41=\"\",\"\",33)","v":""},{"$f":"IF('SP64'!V100=\"\",\"\",Auslosung_Turnierdaten!F41)","v":""},{"$f":"IF('SP64'!V100=\"\",\"\",Auslosung_Turnierdaten!G41)","v":""},{"$f":"IF('SP64'!V100=\"\",\"\",Auslosung_Turnierdaten!H41)","v":""},{"$f":"IF('SP64'!V100=\"\",\"\",Auslosung_Turnierdaten!I41)","v":""},{"$f":"IF('SP64'!V100=\"\",\"\",'SP64'!X35)","v":""},{"$f":"IF('SP64'!V100=\"\",\"\",'SP64'!Z35)","v":""},{"$f":"IF('SP64'!V100=\"\",\"\",'SP64'!AA35)","v":""},{"$f":"IF('SP64'!V100=\"\",\"\",'SP64'!AC35)","v":""},{"$f":"IF('SP64'!V100=\"\",\"\",IF($AE$67=\"VSp\",'SP64'!AD35,'SP64'!AF35))","v":""},{"$f":"IF('SP64'!V100=\"\",\"\",IF($AF$67=\"Quot\",'SP64'!AE35,'SP64'!AG35))","v":""},{"$f":"IF($AG$67=\"BED\",'SP64'!AH35,\"\")","v":""},{"$f":"IF($AH$67=\"HS\",'SP64'!AI35,\"\")","v":""},null,null,null,null,null,null,null,0,{"$f":"IF(AND(COUNTIF(L100:L100:$L$129,L100)=1,F100+G100>0),L100 & \"-\",\"\")","v":""},"",null,null,""]
[null,null,99,{"$f":"IF(D85=\"Sieger 69\",\"Sieger 83\",IF(E85=\"Sieger 70\",\"Sieger 83\",IF(D85=E85,\"Freilos\",IF(E85=\"Freilos\",D85,IF(D85=\"Freilos\",E85,IF(F85>G85,D85,IF(G85>F85,E85,\"Sieger 83\")))))))","v":"Sieger 83"},{"$f":"IF(D92=\"Sieger 51\",\"Verlierer 90\",IF(E92=\"Sieger 52\",\"Verlierer 90\",IF(D92=E92,\"Freilos\",IF(D92=\"Freilos\",D92,IF(E92=\"Freilos\",E92,IF(F92>G92,E92,IF(G92>F92,D92,\"Verlierer 90\")))))))","v":"Verlierer 90"},null,null,null,null,null,null,null,"",0,0,0,0,0,0,0,0,{"$f":"IF(Auslosung_Turnierdaten!F42=\"\",\"\",34)","v":""},{"$f":"IF('SP64'!V101=\"\",\"\",Auslosung_Turnierdaten!F42)","v":""},{"$f":"IF('SP64'!V101=\"\",\"\",Auslosung_Turnierdaten!G42)","v":""},{"$f":"IF('SP64'!V101=\"\",\"\",Auslosung_Turnierdaten!H42)","v":""},{"$f":"IF('SP64'!V101=\"\",\"\",Auslosung_Turnierdaten!I42)","v":""},{"$f":"IF('SP64'!V101=\"\",\"\",'SP64'!X36)","v":""},{"$f":"IF('SP64'!V101=\"\",\"\",'SP64'!Z36)","v":""},{"$f":"IF('SP64'!V101=\"\",\"\",'SP64'!AA36)","v":""},{"$f":"IF('SP64'!V101=\"\",\"\",'SP64'!AC36)","v":""},{"$f":"IF('SP64'!V101=\"\",\"\",IF($AE$67=\"VSp\",'SP64'!AD36,'SP64'!AF36))","v":""},{"$f":"IF('SP64'!V101=\"\",\"\",IF($AF$67=\"Quot\",'SP64'!AE36,'SP64'!AG36))","v":""},{"$f":"IF($AG$67=\"BED\",'SP64'!AH36,\"\")","v":""},{"$f":"IF($AH$67=\"HS\",'SP64'!AI36,\"\")","v":""},null,null,null,null,null,null,null,0,{"$f":"IF(AND(COUNTIF(L101:L101:$L$129,L101)=1,F101+G101>0),L101 & \"-\",\"\")","v":""},"",null,null,""]
[null,null,100,{"$f":"IF(D86=\"Sieger 71\",\"Sieger 84\",IF(E86=\"Sieger 72\",\"Sieger 84\",IF(D86=E86,\"Freilos\",IF(E86=\"Freilos\",D86,IF(D86=\"Freilos\",E86,IF(F86>G86,D86,IF(G86>F86,E86,\"Sieger 84\")))))))","v":"Sieger 84"},{"$f":"IF(D91=\"Sieger 49\",\"Verlierer 89\",IF(E91=\"Sieger 50\",\"Verlierer 89\",IF(D91=E91,\"Freilos\",IF(D91=\"Freilos\",D91,IF(E91=\"Freilos\",E91,IF(F91>G91,E91,IF(G91>F91,D91,\"Verlierer 89\")))))))","v":"Verlierer 89"},null,null,null,null,null,null,null,"",0,0,0,0,0,0,0,0,{"$f":"IF(Auslosung_Turnierdaten!F43=\"\",\"\",35)","v":""},{"$f":"IF('SP64'!V102=\"\",\"\",Auslosung_Turnierdaten!F43)","v":""},{"$f":"IF('SP64'!V102=\"\",\"\",Auslosung_Turnierdaten!G43)","v":""},{"$f":"IF('SP64'!V102=\"\",\"\",Auslosung_Turnierdaten!H43)","v":""},{"$f":"IF('SP64'!V102=\"\",\"\",Auslosung_Turnierdaten!I43)","v":""},{"$f":"IF('SP64'!V102=\"\",\"\",'SP64'!X37)","v":""},{"$f":"IF('SP64'!V102=\"\",\"\",'SP64'!Z37)","v":""},{"$f":"IF('SP64'!V102=\"\",\"\",'SP64'!AA37)","v":""},{"$f":"IF('SP64'!V102=\"\",\"\",'SP64'!AC37)","v":""},{"$f":"IF('SP64'!V102=\"\",\"\",IF($AE$67=\"VSp\",'SP64'!AD37,'SP64'!AF37))","v":""},{"$f":"IF('SP64'!V102=\"\",\"\",IF($AF$67=\"Quot\",'SP64'!AE37,'SP64'!AG37))","v":""},{"$f":"IF($AG$67=\"BED\",'SP64'!AH37,\"\")","v":""},{"$f":"IF($AH$67=\"HS\",'SP64'!AI37,\"\")","v":""},null,null,null,null,null,null,null,0,{"$f":"IF(AND(COUNTIF(L102:L102:$L$129,L102)=1,F102+G102>0),L102 & \"-\",\"\")","v":""},"",null,null,""]
[null,null,101,{"$f":"IF(D87=\"Sieger 73\",\"Sieger 85\",IF(E87=\"Sieger 74\",\"Sieger 85\",IF(D87=E87,\"Freilos\",IF(E87=\"Freilos\",D87,IF(D87=\"Freilos\",E87,IF(F87>G87,D87,IF(G87>F87,E87,\"Sieger 85\")))))))","v":"Sieger 85"},{"$f":"IF(D98=\"Sieger 63\",\"Verlierer 96\",IF(E98=\"Sieger 64\",\"Verlierer 96\",IF(D98=E98,\"Freilos\",IF(D98=\"Freilos\",D98,IF(E98=\"Freilos\",E98,IF(F98>G98,E98,IF(G98>F98,D98,\"Verlierer 96\")))))))","v":"Verlierer 96"},null,null,null,null,null,null,null,"",0,0,0,0,0,0,0,0,{"$f":"IF(Auslosung_Turnierdaten!F44=\"\",\"\",36)","v":""},{"$f":"IF('SP64'!V103=\"\",\"\",Auslosung_Turnierdaten!F44)","v":""},{"$f":"IF('SP64'!V103=\"\",\"\",Auslosung_Turnierdaten!G44)","v":""},{"$f":"IF('SP64'!V103=\"\",\"\",Auslosung_Turnierdaten!H44)","v":""},{"$f":"IF('SP64'!V103=\"\",\"\",Auslosung_Turnierdaten!I44)","v":""},{"$f":"IF('SP64'!V103=\"\",\"\",'SP64'!X38)","v":""},{"$f":"IF('SP64'!V103=\"\",\"\",'SP64'!Z38)","v":""},{"$f":"IF('SP64'!V103=\"\",\"\",'SP64'!AA38)","v":""},{"$f":"IF('SP64'!V103=\"\",\"\",'SP64'!AC38)","v":""},{"$f":"IF('SP64'!V103=\"\",\"\",IF($AE$67=\"VSp\",'SP64'!AD38,'SP64'!AF38))","v":""},{"$f":"IF('SP64'!V103=\"\",\"\",IF($AF$67=\"Quot\",'SP64'!AE38,'SP64'!AG38))","v":""},{"$f":"IF($AG$67=\"BED\",'SP64'!AH38,\"\")","v":""},{"$f":"IF($AH$67=\"HS\",'SP64'!AI38,\"\")","v":""},null,null,null,null,null,null,null,0,{"$f":"IF(AND(COUNTIF(L103:L103:$L$129,L103)=1,F103+G103>0),L103 & \"-\",\"\")","v":""},"",null,null,""]
[null,null,102,{"$f":"IF(D88=\"Sieger 75\",\"Sieger 86\",IF(E88=\"Sieger 76\",\"Sieger 86\",IF(D88=E88,\"Freilos\",IF(E88=\"Freilos\",D88,IF(D88=\"Freilos\",E88,IF(F88>G88,D88,IF(G88>F88,E88,\"Sieger 86\")))))))","v":"Sieger 86"},{"$f":"IF(D97=\"Sieger 61\",\"Verlierer 95\",IF(E97=\"Sieger 62\",\"Verlierer 95\",IF(D97=E97,\"Freilos\",IF(D97=\"Freilos\",D97,IF(E97=\"Freilos\",E97,IF(F97>G97,E97,IF(G97>F97,D97,\"Verlierer 95\")))))))","v":"Verlierer 95"},null,null,null,null,null,null,null,"",0,0,0,0,0,0,0,0,{"$f":"IF(Auslosung_Turnierdaten!F45=\"\",\"\",37)","v":""},{"$f":"IF('SP64'!V104=\"\",\"\",Auslosung_Turnierdaten!F45)","v":""},{"$f":"IF('SP64'!V104=\"\",\"\",Auslosung_Turnierdaten!G45)","v":""},{"$f":"IF('SP64'!V104=\"\",\"\",Auslosung_Turnierdaten!H45)","v":""},{"$f":"IF('SP64'!V104=\"\",\"\",Auslosung_Turnierdaten!I45)","v":""},{"$f":"IF('SP64'!V104=\"\",\"\",'SP64'!X39)","v":""},{"$f":"IF('SP64'!V104=\"\",\"\",'SP64'!Z39)","v":""},{"$f":"IF('SP64'!V104=\"\",\"\",'SP64'!AA39)","v":""},{"$f":"IF('SP64'!V104=\"\",\"\",'SP64'!AC39)","v":""},{"$f":"IF('SP64'!V104=\"\",\"\",IF($AE$67=\"VSp\",'SP64'!AD39,'SP64'!AF39))","v":""},{"$f":"IF('SP64'!V104=\"\",\"\",IF($AF$67=\"Quot\",'SP64'!AE39,'SP64'!AG39))","v":""},{"$f":"IF($AG$67=\"BED\",'SP64'!AH39,\"\")","v":""},{"$f":"IF($AH$67=\"HS\",'SP64'!AI39,\"\")","v":""},null,null,null,null,null,null,null,0,{"$f":"IF(AND(COUNTIF(L104:L104:$L$129,L104)=1,F104+G104>0),L104 & \"-\",\"\")","v":""},"",null,null,""]
[null,null,103,{"$f":"IF(D89=\"Sieger 77\",\"Sieger 87\",IF(E89=\"Sieger 78\",\"Sieger 87\",IF(D89=E89,\"Freilos\",IF(E89=\"Freilos\",D89,IF(D89=\"Freilos\",E89,IF(F89>G89,D89,IF(G89>F89,E89,\"Sieger 87\")))))))","v":"Sieger 87"},{"$f":"IF(D96=\"Sieger 59\",\"Verlierer 94\",IF(E96=\"Sieger 60\",\"Verlierer 94\",IF(D96=E96,\"Freilos\",IF(D96=\"Freilos\",D96,IF(E96=\"Freilos\",E96,IF(F96>G96,E96,IF(G96>F96,D96,\"Verlierer 94\")))))))","v":"Verlierer 94"},null,null,null,null,null,null,null,"",0,0,0,0,0,0,0,0,{"$f":"IF(Auslosung_Turnierdaten!F46=\"\",\"\",38)","v":""},{"$f":"IF('SP64'!V105=\"\",\"\",Auslosung_Turnierdaten!F46)","v":""},{"$f":"IF('SP64'!V105=\"\",\"\",Auslosung_Turnierdaten!G46)","v":""},{"$f":"IF('SP64'!V105=\"\",\"\",Auslosung_Turnierdaten!H46)","v":""},{"$f":"IF('SP64'!V105=\"\",\"\",Auslosung_Turnierdaten!I46)","v":""},{"$f":"IF('SP64'!V105=\"\",\"\",'SP64'!X40)","v":""},{"$f":"IF('SP64'!V105=\"\",\"\",'SP64'!Z40)","v":""},{"$f":"IF('SP64'!V105=\"\",\"\",'SP64'!AA40)","v":""},{"$f":"IF('SP64'!V105=\"\",\"\",'SP64'!AC40)","v":""},{"$f":"IF('SP64'!V105=\"\",\"\",IF($AE$67=\"VSp\",'SP64'!AD40,'SP64'!AF40))","v":""},{"$f":"IF('SP64'!V105=\"\",\"\",IF($AF$67=\"Quot\",'SP64'!AE40,'SP64'!AG40))","v":""},{"$f":"IF($AG$67=\"BED\",'SP64'!AH40,\"\")","v":""},{"$f":"IF($AH$67=\"HS\",'SP64'!AI40,\"\")","v":""},null,null,null,null,null,null,null,0,{"$f":"IF(AND(COUNTIF(L105:L105:$L$129,L105)=1,F105+G105>0),L105 & \"-\",\"\")","v":""},"",null,null,""]
[null,null,104,{"$f":"IF(D90=\"Sieger 79\",\"Sieger 88\",IF(E90=\"Sieger 80\",\"Sieger 88\",IF(D90=E90,\"Freilos\",IF(E90=\"Freilos\",D90,IF(D90=\"Freilos\",E90,IF(F90>G90,D90,IF(G90>F90,E90,\"Sieger 88\")))))))","v":"Sieger 88"},{"$f":"IF(D95=\"Sieger 57\",\"Verlierer 93\",IF(E95=\"Sieger 58\",\"Verlierer 93\",IF(D95=E95,\"Freilos\",IF(D95=\"Freilos\",D95,IF(E95=\"Freilos\",E95,IF(F95>G95,E95,IF(G95>F95,D95,\"Verlierer 93\")))))))","v":"Verlierer 93"},null,null,null,null,null,null,null,"",0,0,0,0,0,0,0,0,{"$f":"IF(Auslosung_Turnierdaten!F47=\"\",\"\",39)","v":""},{"$f":"IF('SP64'!V106=\"\",\"\",Auslosung_Turnierdaten!F47)","v":""},{"$f":"IF('SP64'!V106=\"\",\"\",Auslosung_Turnierdaten!G47)","v":""},{"$f":"IF('SP64'!V106=\"\",\"\",Auslosung_Turnierdaten!H47)","v":""},{"$f":"IF('SP64'!V106=\"\",\"\",Auslosung_Turnierdaten!I47)","v":""},{"$f":"IF('SP64'!V106=\"\",\"\",'SP64'!X41)","v":""},{"$f":"IF('SP64'!V106=\"\",\"\",'SP64'!Z41)","v":""},{"$f":"IF('SP64'!V106=\"\",\"\",'SP64'!AA41)","v":""},{"$f":"IF('SP64'!V106=\"\",\"\",'SP64'!AC41)","v":""},{"$f":"IF('SP64'!V106=\"\",\"\",IF($AE$67=\"VSp\",'SP64'!AD41,'SP64'!AF41))","v":""},{"$f":"IF('SP64'!V106=\"\",\"\",IF($AF$67=\"Quot\",'SP64'!AE41,'SP64'!AG41))","v":""},{"$f":"IF($AG$67=\"BED\",'SP64'!AH41,\"\")","v":""},{"$f":"IF($AH$67=\"HS\",'SP64'!AI41,\"\")","v":""},null,null,null,null,null,null,null,0,{"$f":"IF(AND(COUNTIF(L106:L106:$L$129,L106)=1,F106+G106>0),L106 & \"-\",\"\")","v":""},"",null,null,""]
[null,"VR5",105,{"$f":"IF(D99=\"Sieger 81\",\"Sieger 97\",IF(E99=\"Verlierer 92\",\"Sieger 97\",IF(D99=E99,\"Freilos\",IF(E99=\"Freilos\",D99,IF(D99=\"Freilos\",E99,IF(F99>G99,D99,IF(G99>F99,E99,\"Sieger 97\")))))))","v":"Sieger 97"},{"$f":"IF(D100=\"Sieger 82\",\"Sieger 98\",IF(E100=\"Verlierer 91\",\"Sieger 98\",IF(D100=E100,\"Freilos\",IF(E100=\"Freilos\",D100,IF(D100=\"Freilos\",E100,IF(F100>G100,D100,IF(G100>F100,E100,\"Sieger 98\")))))))","v":"Sieger 98"},null,null,null,null,null,null,null,{"$f":"IF(F107>G107,E107,IF(G107>F107,D107,\"\"))","v":""},{"$f":"F107+G107","v":0},0,{"$f":"IF(D107=\"Freilos\",0,IF(F107<G107,1,IF(F107>G107,1,0)))","v":0},{"$f":"IF(D107=\"Freilos\",0,IF(F107<G107,1,IF(F107>G107,1,0)))","v":0},{"$f":"IF(D107=\"Freilos\",0,IF(F107>G107,1,0))","v":0},{"$f":"IF(D107=\"Freilos\",0,IF(G107>F107,1,0))","v":0},0,0,{"$f":"IF(Auslosung_Turnierdaten!F48=\"\",\"\",40)","v":""},{"$f":"IF('SP64'!V107=\"\",\"\",Auslosung_Turnierdaten!F48)","v":""},{"$f":"IF('SP64'!V107=\"\",\"\",Auslosung_Turnierdaten!G48)","v":""},{"$f":"IF('SP64'!V107=\"\",\"\",Auslosung_Turnierdaten!H48)","v":""},{"$f":"IF('SP64'!V107=\"\",\"\",Auslosung_Turnierdaten!I48)","v":""},{"$f":"IF('SP64'!V107=\"\",\"\",'SP64'!X42)","v":""},{"$f":"IF('SP64'!V107=\"\",\"\",'SP64'!Z42)","v":""},{"$f":"IF('SP64'!V107=\"\",\"\",'SP64'!AA42)","v":""},{"$f":"IF('SP64'!V107=\"\",\"\",'SP64'!AC42)","v":""},{"$f":"IF('SP64'!V107=\"\",\"\",IF($AE$67=\"VSp\",'SP64'!AD42,'SP64'!AF42))","v":""},{"$f":"IF('SP64'!V107=\"\",\"\",IF($AF$67=\"Quot\",'SP64'!AE42,'SP64'!AG42))","v":""},{"$f":"IF($AG$67=\"BED\",'SP64'!AH42,\"\")","v":""},{"$f":"IF($AH$67=\"HS\",'SP64'!AI42,\"\")","v":""},null,null,null,null,null,null,null,0,{"$f":"IF(AND(COUNTIF(L107:L107:$L$129,L107)=1,F107+G107>0),L107 & \"-\",\"\")","v":""},"",null,null,""]
[null,null,106,{"$f":"IF(D101=\"Sieger 83\",\"Sieger 99\",IF(E101=\"Verlierer 90\",\"Sieger 99\",IF(D101=E101,\"Freilos\",IF(E101=\"Freilos\",D101,IF(D101=\"Freilos\",E101,IF(F101>G101,D101,IF(G101>F101,E101,\"Sieger 99\")))))))","v":"Sieger 99"},{"$f":"IF(D102=\"Sieger 84\",\"Sieger 100\",IF(E102=\"Verlierer 89\",\"Sieger 100\",IF(D102=E102,\"Freilos\",IF(E102=\"Freilos\",D102,IF(D102=\"Freilos\",E102,IF(F102>G102,D102,IF(G102>F102,E102,\"Sieger 100\")))))))","v":"Sieger 100"},null,null,null,null,null,null,null,{"$f":"IF(F108>G108,E108,IF(G108>F108,D108,\"\"))","v":""},0,0,0,0,0,0,0,0,{"$f":"IF(Auslosung_Turnierdaten!F49=\"\",\"\",41)","v":""},{"$f":"IF('SP64'!V108=\"\",\"\",Auslosung_Turnierdaten!F49)","v":""},{"$f":"IF('SP64'!V108=\"\",\"\",Auslosung_Turnierdaten!G49)","v":""},{"$f":"IF('SP64'!V108=\"\",\"\",Auslosung_Turnierdaten!H49)","v":""},{"$f":"IF('SP64'!V108=\"\",\"\",Auslosung_Turnierdaten!I49)","v":""},{"$f":"IF('SP64'!V108=\"\",\"\",'SP64'!X43)","v":""},{"$f":"IF('SP64'!V108=\"\",\"\",'SP64'!Z43)","v":""},{"$f":"IF('SP64'!V108=\"\",\"\",'SP64'!AA43)","v":""},{"$f":"IF('SP64'!V108=\"\",\"\",'SP64'!AC43)","v":""},{"$f":"IF('SP64'!V108=\"\",\"\",IF($AE$67=\"VSp\",'SP64'!AD43,'SP64'!AF43))","v":""},{"$f":"IF('SP64'!V108=\"\",\"\",IF($AF$67=\"Quot\",'SP64'!AE43,'SP64'!AG43))","v":""},{"$f":"IF($AG$67=\"BED\",'SP64'!AH43,\"\")","v":""},{"$f":"IF($AH$67=\"HS\",'SP64'!AI43,\"\")","v":""},null,null,null,null,null,null,null,0,{"$f":"IF(AND(COUNTIF(L108:L108:$L$129,L108)=1,F108+G108>0),L108 & \"-\",\"\")","v":""},"",null,null,""]
[null,null,107,{"$f":"IF(D103=\"Sieger 85\",\"Sieger 101\",IF(E103=\"Verlierer 96\",\"Sieger 101\",IF(D103=E103,\"Freilos\",IF(E103=\"Freilos\",D103,IF(D103=\"Freilos\",E103,IF(F103>G103,D103,IF(G103>F103,E103,\"Sieger 101\")))))))","v":"Sieger 101"},{"$f":"IF(D104=\"Sieger 86\",\"Sieger 102\",IF(E104=\"Verlierer 95\",\"Sieger 102\",IF(D104=E104,\"Freilos\",IF(E104=\"Freilos\",D104,IF(D104=\"Freilos\",E104,IF(F104>G104,D104,IF(G104>F104,E104,\"Sieger 102\")))))))","v":"Sieger 102"},null,null,null,null,null,null,null,{"$f":"IF(F109>G109,E109,IF(G109>F109,D109,\"\"))","v":""},0,0,0,0,0,0,0,0,{"$f":"IF(Auslosung_Turnierdaten!F50=\"\",\"\",42)","v":""},{"$f":"IF('SP64'!V109=\"\",\"\",Auslosung_Turnierdaten!F50)","v":""},{"$f":"IF('SP64'!V109=\"\",\"\",Auslosung_Turnierdaten!G50)","v":""},{"$f":"IF('SP64'!V109=\"\",\"\",Auslosung_Turnierdaten!H50)","v":""},{"$f":"IF('SP64'!V109=\"\",\"\",Auslosung_Turnierdaten!I50)","v":""},{"$f":"IF('SP64'!V109=\"\",\"\",'SP64'!X44)","v":""},{"$f":"IF('SP64'!V109=\"\",\"\",'SP64'!Z44)","v":""},{"$f":"IF('SP64'!V109=\"\",\"\",'SP64'!AA44)","v":""},{"$f":"IF('SP64'!V109=\"\",\"\",'SP64'!AC44)","v":""},{"$f":"IF('SP64'!V109=\"\",\"\",IF($AE$67=\"VSp\",'SP64'!AD44,'SP64'!AF44))","v":""},{"$f":"IF('SP64'!V109=\"\",\"\",IF($AF$67=\"Quot\",'SP64'!AE44,'SP64'!AG44))","v":""},{"$f":"IF($AG$67=\"BED\",'SP64'!AH44,\"\")","v":""},{"$f":"IF($AH$67=\"HS\",'SP64'!AI44,\"\")","v":""},null,null,null,null,null,null,null,0,{"$f":"IF(AND(COUNTIF(L109:L109:$L$129,L109)=1,F109+G109>0),L109 & \"-\",\"\")","v":""},"",null,null,""]
[null,null,108,{"$f":"IF(D105=\"Sieger 87\",\"Sieger 103\",IF(E105=\"Verlierer 94\",\"Sieger 103\",IF(D105=E105,\"Freilos\",IF(E105=\"Freilos\",D105,IF(D105=\"Freilos\",E105,IF(F105>G105,D105,IF(G105>F105,E105,\"Sieger 103\")))))))","v":"Sieger 103"},{"$f":"IF(D106=\"Sieger 88\",\"Sieger 104\",IF(E106=\"Verlierer 93\",\"Sieger 104\",IF(D106=E106,\"Freilos\",IF(E106=\"Freilos\",D106,IF(D106=\"Freilos\",E106,IF(F106>G106,D106,IF(G106>F106,E106,\"Sieger 104\")))))))","v":"Sieger 104"},null,null,null,null,null,null,null,{"$f":"IF(F110>G110,E110,IF(G110>F110,D110,\"\"))","v":""},0,0,0,0,0,0,0,0,{"$f":"IF(Auslosung_Turnierdaten!F51=\"\",\"\",43)","v":""},{"$f":"IF('SP64'!V110=\"\",\"\",Auslosung_Turnierdaten!F51)","v":""},{"$f":"IF('SP64'!V110=\"\",\"\",Auslosung_Turnierdaten!G51)","v":""},{"$f":"IF('SP64'!V110=\"\",\"\",Auslosung_Turnierdaten!H51)","v":""},{"$f":"IF('SP64'!V110=\"\",\"\",Auslosung_Turnierdaten!I51)","v":""},{"$f":"IF('SP64'!V110=\"\",\"\",'SP64'!X45)","v":""},{"$f":"IF('SP64'!V110=\"\",\"\",'SP64'!Z45)","v":""},{"$f":"IF('SP64'!V110=\"\",\"\",'SP64'!AA45)","v":""},{"$f":"IF('SP64'!V110=\"\",\"\",'SP64'!AC45)","v":""},{"$f":"IF('SP64'!V110=\"\",\"\",IF($AE$67=\"VSp\",'SP64'!AD45,'SP64'!AF45))","v":""},{"$f":"IF('SP64'!V110=\"\",\"\",IF($AF$67=\"Quot\",'SP64'!AE45,'SP64'!AG45))","v":""},{"$f":"IF($AG$67=\"BED\",'SP64'!AH45,\"\")","v":""},{"$f":"IF($AH$67=\"HS\",'SP64'!AI45,\"\")","v":""},null,null,null,null,null,null,null,0,{"$f":"IF(AND(COUNTIF(L110:L110:$L$129,L110)=1,F110+G110>0),L110 & \"-\",\"\")","v":""},"",null,null,""]
[null,"GR3",109,{"$f":"IF(D91=\"Sieger 49\",\"Sieger 89\",IF(E91=\"Sieger 50\",\"Sieger 89\",IF(D91=E91,\"Freilos\",IF(E91=\"Freilos\",D91,IF(D91=\"Freilos\",E91,IF(F91>G91,D91,IF(G91>F91,E91,\"Sieger 89\")))))))","v":"Sieger 89"},{"$f":"IF(D92=\"Sieger 51\",\"Sieger 90\",IF(E92=\"Sieger 52\",\"Sieger 90\",IF(D92=E92,\"Freilos\",IF(E92=\"Freilos\",D92,IF(D92=\"Freilos\",E92,IF(F92>G92,D92,IF(G92>F92,E92,\"Sieger 90\")))))))","v":"Sieger 90"},null,null,null,null,null,null,null,null,0,0,0,0,0,0,{"$f":"IF(E111=\"Freilos\",6,IF(F111>G111,6,0))","v":0},{"$f":"IF(D111=\"Freilos\",6,IF(G111>F111,6,0))","v":0},{"$f":"IF(Auslosung_Turnierdaten!F52=\"\",\"\",44)","v":""},{"$f":"IF('SP64'!V111=\"\",\"\",Auslosung_Turnierdaten!F52)","v":""},{"$f":"IF('SP64'!V111=\"\",\"\",Auslosung_Turnierdaten!G52)","v":""},{"$f":"IF('SP64'!V111=\"\",\"\",Auslosung_Turnierdaten!H52)","v":""},{"$f":"IF('SP64'!V111=\"\",\"\",Auslosung_Turnierdaten!I52)","v":""},{"$f":"IF('SP64'!V111=\"\",\"\",'SP64'!X46)","v":""},{"$f":"IF('SP64'!V111=\"\",\"\",'SP64'!Z46)","v":""},{"$f":"IF('SP64'!V111=\"\",\"\",'SP64'!AA46)","v":""},{"$f":"IF('SP64'!V111=\"\",\"\",'SP64'!AC46)","v":""},{"$f":"IF('SP64'!V111=\"\",\"\",IF($AE$67=\"VSp\",'SP64'!AD46,'SP64'!AF46))","v":""},{"$f":"IF('SP64'!V111=\"\",\"\",IF($AF$67=\"Quot\",'SP64'!AE46,'SP64'!AG46))","v":""},{"$f":"IF($AG$67=\"BED\",'SP64'!AH46,\"\")","v":""},{"$f":"IF($AH$67=\"HS\",'SP64'!AI46,\"\")","v":""},null,null,null,null,null,null,null,0,{"$f":"IF(AND(COUNTIF(L111:L111:$L$129,L111)=1,F111+G111>0),L111 & \"-\",\"\")","v":""},"",null,null,""]
[null,null,110,{"$f":"IF(D93=\"Sieger 53\",\"Sieger 91\",IF(E93=\"Sieger 54\",\"Sieger 91\",IF(D93=E93,\"Freilos\",IF(E93=\"Freilos\",D93,IF(D93=\"Freilos\",E93,IF(F93>G93,D93,IF(G93>F93,E93,\"Sieger 91\")))))))","v":"Sieger 91"},{"$f":"IF(D94=\"Sieger 55\",\"Sieger 92\",IF(E94=\"Sieger 56\",\"Sieger 92\",IF(D94=E94,\"Freilos\",IF(E94=\"Freilos\",D94,IF(D94=\"Freilos\",E94,IF(F94>G94,D94,IF(G94>F94,E94,\"Sieger 92\")))))))","v":"Sieger 92"},null,null,null,null,null,null,null,null,0,0,0,0,0,0,{"$f":"IF(E112=\"Freilos\",6,IF(F112>G112,6,0))","v":0},{"$f":"IF(D112=\"Freilos\",6,IF(G112>F112,6,0))","v":0},{"$f":"IF(Auslosung_Turnierdaten!F53=\"\",\"\",45)","v":""},{"$f":"IF('SP64'!V112=\"\",\"\",Auslosung_Turnierdaten!F53)","v":""},{"$f":"IF('SP64'!V112=\"\",\"\",Auslosung_Turnierdaten!G53)","v":""},{"$f":"IF('SP64'!V112=\"\",\"\",Auslosung_Turnierdaten!H53)","v":""},{"$f":"IF('SP64'!V112=\"\",\"\",Auslosung_Turnierdaten!I53)","v":""},{"$f":"IF('SP64'!V112=\"\",\"\",'SP64'!X47)","v":""},{"$f":"IF('SP64'!V112=\"\",\"\",'SP64'!Z47)","v":""},{"$f":"IF('SP64'!V112=\"\",\"\",'SP64'!AA47)","v":""},{"$f":"IF('SP64'!V112=\"\",\"\",'SP64'!AC47)","v":""},{"$f":"IF('SP64'!V112=\"\",\"\",IF($AE$67=\"VSp\",'SP64'!AD47,'SP64'!AF47))","v":""},{"$f":"IF('SP64'!V112=\"\",\"\",IF($AF$67=\"Quot\",'SP64'!AE47,'SP64'!AG47))","v":""},{"$f":"IF($AG$67=\"BED\",'SP64'!AH47,\"\")","v":""},{"$f":"IF($AH$67=\"HS\",'SP64'!AI47,\"\")","v":""},null,null,null,null,null,null,null,0,{"$f":"IF(AND(COUNTIF(L112:L112:$L$129,L112)=1,F112+G112>0),L112 & \"-\",\"\")","v":""},"",null,null,""]
[null,null,111,{"$f":"IF(D95=\"Sieger 57\",\"Sieger 93\",IF(E95=\"Sieger 58\",\"Sieger 93\",IF(D95=E95,\"Freilos\",IF(E95=\"Freilos\",D95,IF(D95=\"Freilos\",E95,IF(F95>G95,D95,IF(G95>F95,E95,\"Sieger 93\")))))))","v":"Sieger 93"},{"$f":"IF(D96=\"Sieger 59\",\"Sieger 94\",IF(E96=\"Sieger 60\",\"Sieger 94\",IF(D96=E96,\"Freilos\",IF(E96=\"Freilos\",D96,IF(D96=\"Freilos\",E96,IF(F96>G96,D96,IF(G96>F96,E96,\"Sieger 94\")))))))","v":"Sieger 94"},null,null,null,null,null,null,null,null,0,0,0,0,0,0,{"$f":"IF(E113=\"Freilos\",6,IF(F113>G113,6,0))","v":0},{"$f":"IF(D113=\"Freilos\",6,IF(G113>F113,6,0))","v":0},{"$f":"IF(Auslosung_Turnierdaten!F54=\"\",\"\",46)","v":""},{"$f":"IF('SP64'!V113=\"\",\"\",Auslosung_Turnierdaten!F54)","v":""},{"$f":"IF('SP64'!V113=\"\",\"\",Auslosung_Turnierdaten!G54)","v":""},{"$f":"IF('SP64'!V113=\"\",\"\",Auslosung_Turnierdaten!H54)","v":""},{"$f":"IF('SP64'!V113=\"\",\"\",Auslosung_Turnierdaten!I54)","v":""},{"$f":"IF('SP64'!V113=\"\",\"\",'SP64'!X48)","v":""},{"$f":"IF('SP64'!V113=\"\",\"\",'SP64'!Z48)","v":""},{"$f":"IF('SP64'!V113=\"\",\"\",'SP64'!AA48)","v":""},{"$f":"IF('SP64'!V113=\"\",\"\",'SP64'!AC48)","v":""},{"$f":"IF('SP64'!V113=\"\",\"\",IF($AE$67=\"VSp\",'SP64'!AD48,'SP64'!AF48))","v":""},{"$f":"IF('SP64'!V113=\"\",\"\",IF($AF$67=\"Quot\",'SP64'!AE48,'SP64'!AG48))","v":""},{"$f":"IF($AG$67=\"BED\",'SP64'!AH48,\"\")","v":""},{"$f":"IF($AH$67=\"HS\",'SP64'!AI48,\"\")","v":""},null,null,null,null,null,null,null,0,{"$f":"IF(AND(COUNTIF(L113:L113:$L$129,L113)=1,F113+G113>0),L113 & \"-\",\"\")","v":""},"",null,null,""]
[null,null,112,{"$f":"IF(D97=\"Sieger 61\",\"Sieger 95\",IF(E97=\"Sieger 62\",\"Sieger 95\",IF(D97=E97,\"Freilos\",IF(E97=\"Freilos\",D97,IF(D97=\"Freilos\",E97,IF(F97>G97,D97,IF(G97>F97,E97,\"Sieger 95\")))))))","v":"Sieger 95"},{"$f":"IF(D98=\"Sieger 63\",\"Sieger 96\",IF(E98=\"Sieger 64\",\"Sieger 96\",IF(D98=E98,\"Freilos\",IF(E98=\"Freilos\",D98,IF(D98=\"Freilos\",E98,IF(F98>G98,D98,IF(G98>F98,E98,\"Sieger 96\")))))))","v":"Sieger 96"},null,null,null,null,null,null,null,null,0,0,0,0,0,0,{"$f":"IF(E114=\"Freilos\",6,IF(F114>G114,6,0))","v":0},{"$f":"IF(D114=\"Freilos\",6,IF(G114>F114,6,0))","v":0},{"$f":"IF(Auslosung_Turnierdaten!F55=\"\",\"\",47)","v":""},{"$f":"IF('SP64'!V114=\"\",\"\",Auslosung_Turnierdaten!F55)","v":""},{"$f":"IF('SP64'!V114=\"\",\"\",Auslosung_Turnierdaten!G55)","v":""},{"$f":"IF('SP64'!V114=\"\",\"\",Auslosung_Turnierdaten!H55)","v":""},{"$f":"IF('SP64'!V114=\"\",\"\",Auslosung_Turnierdaten!I55)","v":""},{"$f":"IF('SP64'!V114=\"\",\"\",'SP64'!X49)","v":""},{"$f":"IF('SP64'!V114=\"\",\"\",'SP64'!Z49)","v":""},{"$f":"IF('SP64'!V114=\"\",\"\",'SP64'!AA49)","v":""},{"$f":"IF('SP64'!V114=\"\",\"\",'SP64'!AC49)","v":""},{"$f":"IF('SP64'!V114=\"\",\"\",IF($AE$67=\"VSp\",'SP64'!AD49,'SP64'!AF49))","v":""},{"$f":"IF('SP64'!V114=\"\",\"\",IF($AF$67=\"Quot\",'SP64'!AE49,'SP64'!AG49))","v":""},{"$f":"IF($AG$67=\"BED\",'SP64'!AH49,\"\")","v":""},{"$f":"IF($AH$67=\"HS\",'SP64'!AI49,\"\")","v":""},null,null,null,null,null,null,null,0,{"$f":"IF(AND(COUNTIF(L114:L114:$L$129,L114)=1,F114+G114>0),L114 & \"-\",\"\")","v":""},"",null,null,""]
[null,"VR6",113,{"$f":"IF(D107=\"Sieger 97\",\"Sieger 105\",IF(E107=\"Sieger 98\",\"Sieger 105\",IF(D107=E107,\"Freilos\",IF(E107=\"Freilos\",D107,IF(D107=\"Freilos\",E107,IF(F107>G107,D107,IF(G107>F107,E107,\"Sieger 105\")))))))","v":"Sieger 105"},{"$f":"IF(D113=\"Sieger 93\",\"Verlierer 111\",IF(E113=\"Sieger 94\",\"Verlierer 111\",IF(D113=E113,\"Freilos\",IF(E113=\"Freilos\",E113,IF(D113=\"Freilos\",D113,IF(F113>G113,E113,IF(G113>F113,D113,\"Verlierer 111\")))))))","v":"Verlierer 111"},null,null,null,null,null,null,null,{"$f":"IF(F115>G115,E115,IF(G115>F115,D115,\"\"))","v":""},0,0,0,0,0,0,0,0,{"$f":"IF(Auslosung_Turnierdaten!F56=\"\",\"\",48)","v":""},{"$f":"IF('SP64'!V115=\"\",\"\",Auslosung_Turnierdaten!F56)","v":""},{"$f":"IF('SP64'!V115=\"\",\"\",Auslosung_Turnierdaten!G56)","v":""},{"$f":"IF('SP64'!V115=\"\",\"\",Auslosung_Turnierdaten!H56)","v":""},{"$f":"IF('SP64'!V115=\"\",\"\",Auslosung_Turnierdaten!I56)","v":""},{"$f":"IF('SP64'!V115=\"\",\"\",'SP64'!X50)","v":""},{"$f":"IF('SP64'!V115=\"\",\"\",'SP64'!Z50)","v":""},{"$f":"IF('SP64'!V115=\"\",\"\",'SP64'!AA50)","v":""},{"$f":"IF('SP64'!V115=\"\",\"\",'SP64'!AC50)","v":""},{"$f":"IF('SP64'!V115=\"\",\"\",IF($AE$67=\"VSp\",'SP64'!AD50,'SP64'!AF50))","v":""},{"$f":"IF('SP64'!V115=\"\",\"\",IF($AF$67=\"Quot\",'SP64'!AE50,'SP64'!AG50))","v":""},{"$f":"IF($AG$67=\"BED\",'SP64'!AH50,\"\")","v":""},{"$f":"IF($AH$67=\"HS\",'SP64'!AI50,\"\")","v":""},null,null,null,null,null,null,null,0,{"$f":"IF(AND(COUNTIF(L115:L115:$L$129,L115)=1,F115+G115>0),L115 & \"-\",\"\")","v":""},"",null,null,""]
[null,null,114,{"$f":"IF(D108=\"Sieger 99\",\"Sieger 106\",IF(E108=\"Sieger 100\",\"Sieger 106\",IF(D108=E108,\"Freilos\",IF(E108=\"Freilos\",D108,IF(D108=\"Freilos\",E108,IF(F108>G108,D108,IF(G108>F108,E108,\"Sieger 106\")))))))","v":"Sieger 106"},{"$f":"IF(D114=\"Sieger 95\",\"Verlierer 112\",IF(E114=\"Sieger 96\",\"Verlierer 112\",IF(D114=E114,\"Freilos\",IF(E114=\"Freilos\",E114,IF(D114=\"Freilos\",D114,IF(F114>G114,E114,IF(G114>F114,D114,\"Verlierer 112\")))))))","v":"Verlierer 112"},null,null,null,null,null,null,null,"",0,0,0,0,0,0,0,0,{"$f":"IF(Auslosung_Turnierdaten!F57=\"\",\"\",49)","v":""},{"$f":"IF('SP64'!V116=\"\",\"\",Auslosung_Turnierdaten!F57)","v":""},{"$f":"IF('SP64'!V116=\"\",\"\",Auslosung_Turnierdaten!G57)","v":""},{"$f":"IF('SP64'!V116=\"\",\"\",Auslosung_Turnierdaten!H57)","v":""},{"$f":"IF('SP64'!V116=\"\",\"\",Auslosung_Turnierdaten!I57)","v":""},{"$f":"IF('SP64'!V116=\"\",\"\",'SP64'!X51)","v":""},{"$f":"IF('SP64'!V116=\"\",\"\",'SP64'!Z51)","v":""},{"$f":"IF('SP64'!V116=\"\",\"\",'SP64'!AA51)","v":""},{"$f":"IF('SP64'!V116=\"\",\"\",'SP64'!AC51)","v":""},{"$f":"IF('SP64'!V116=\"\",\"\",IF($AE$67=\"VSp\",'SP64'!AD51,'SP64'!AF51))","v":""},{"$f":"IF('SP64'!V116=\"\",\"\",IF($AF$67=\"Quot\",'SP64'!AE51,'SP64'!AG51))","v":""},{"$f":"IF($AG$67=\"BED\",'SP64'!AH51,\"\")","v":""},{"$f":"IF($AH$67=\"HS\",'SP64'!AI51,\"\")","v":""},null,null,null,null,null,null,null,0,{"$f":"IF(AND(COUNTIF(L116:L116:$L$129,L116)=1,F116+G116>0),L116 & \"-\",\"\")","v":""},"",null,null,""]
[null,null,115,{"$f":"IF(D109=\"Sieger 101\",\"Sieger 107\",IF(E109=\"Sieger 102\",\"Sieger 107\",IF(D109=E109,\"Freilos\",IF(E109=\"Freilos\",D109,IF(D109=\"Freilos\",E109,IF(F109>G109,D109,IF(G109>F109,E109,\"Sieger 107\")))))))","v":"Sieger 107"},{"$f":"IF(D111=\"Sieger 89\",\"Verlierer 109\",IF(E111=\"Sieger 90\",\"Verlierer 109\",IF(D111=E111,\"Freilos\",IF(E111=\"Freilos\",E111,IF(D111=\"Freilos\",D111,IF(F111>G111,E111,IF(G111>F111,D111,\"Verlierer 109\")))))))","v":"Verlierer 109"},null,null,null,null,null,null,null,"",0,0,0,0,0,0,0,0,{"$f":"IF(Auslosung_Turnierdaten!F58=\"\",\"\",50)","v":""},{"$f":"IF('SP64'!V117=\"\",\"\",Auslosung_Turnierdaten!F58)","v":""},{"$f":"IF('SP64'!V117=\"\",\"\",Auslosung_Turnierdaten!G58)","v":""},{"$f":"IF('SP64'!V117=\"\",\"\",Auslosung_Turnierdaten!H58)","v":""},{"$f":"IF('SP64'!V117=\"\",\"\",Auslosung_Turnierdaten!I58)","v":""},{"$f":"IF('SP64'!V117=\"\",\"\",'SP64'!X52)","v":""},{"$f":"IF('SP64'!V117=\"\",\"\",'SP64'!Z52)","v":""},{"$f":"IF('SP64'!V117=\"\",\"\",'SP64'!AA52)","v":""},{"$f":"IF('SP64'!V117=\"\",\"\",'SP64'!AC52)","v":""},{"$f":"IF('SP64'!V117=\"\",\"\",IF($AE$67=\"VSp\",'SP64'!AD52,'SP64'!AF52))","v":""},{"$f":"IF('SP64'!V117=\"\",\"\",IF($AF$67=\"Quot\",'SP64'!AE52,'SP64'!AG52))","v":""},{"$f":"IF($AG$67=\"BED\",'SP64'!AH52,\"\")","v":""},{"$f":"IF($AH$67=\"HS\",'SP64'!AI52,\"\")","v":""},null,null,null,null,null,null,null,0,{"$f":"IF(AND(COUNTIF(L117:L117:$L$129,L117)=1,F117+G117>0),L117 & \"-\",\"\")","v":""},"",null,null,""]
[null,null,116,{"$f":"IF(D110=\"Sieger 103\",\"Sieger 108\",IF(E110=\"Sieger 104\",\"Sieger 108\",IF(D110=E110,\"Freilos\",IF(E110=\"Freilos\",D110,IF(D110=\"Freilos\",E110,IF(F110>G110,D110,IF(G110>F110,E110,\"Sieger 108\")))))))","v":"Sieger 108"},{"$f":"IF(D112=\"Sieger 91\",\"Verlierer 110\",IF(E112=\"Sieger 92\",\"Verlierer 110\",IF(D112=E112,\"Freilos\",IF(E112=\"Freilos\",E112,IF(D112=\"Freilos\",D112,IF(F112>G112,E112,IF(G112>F112,D112,\"Verlierer 110\")))))))","v":"Verlierer 110"},null,null,null,null,null,null,null,"",0,0,0,0,0,0,0,0,{"$f":"IF(Auslosung_Turnierdaten!F59=\"\",\"\",51)","v":""},{"$f":"IF('SP64'!V118=\"\",\"\",Auslosung_Turnierdaten!F59)","v":""},{"$f":"IF('SP64'!V118=\"\",\"\",Auslosung_Turnierdaten!G59)","v":""},{"$f":"IF('SP64'!V118=\"\",\"\",Auslosung_Turnierdaten!H59)","v":""},{"$f":"IF('SP64'!V118=\"\",\"\",Auslosung_Turnierdaten!I59)","v":""},{"$f":"IF('SP64'!V118=\"\",\"\",'SP64'!X53)","v":""},{"$f":"IF('SP64'!V118=\"\",\"\",'SP64'!Z53)","v":""},{"$f":"IF('SP64'!V118=\"\",\"\",'SP64'!AA53)","v":""},{"$f":"IF('SP64'!V118=\"\",\"\",'SP64'!AC53)","v":""},{"$f":"IF('SP64'!V118=\"\",\"\",IF($AE$67=\"VSp\",'SP64'!AD53,'SP64'!AF53))","v":""},{"$f":"IF('SP64'!V118=\"\",\"\",IF($AF$67=\"Quot\",'SP64'!AE53,'SP64'!AG53))","v":""},{"$f":"IF($AG$67=\"BED\",'SP64'!AH53,\"\")","v":""},{"$f":"IF($AH$67=\"HS\",'SP64'!AI53,\"\")","v":""},null,null,null,null,null,null,null,0,{"$f":"IF(AND(COUNTIF(L118:L118:$L$129,L118)=1,F118+G118>0),L118 & \"-\",\"\")","v":""},"",null,null,""]
[null,"VR7",117,{"$f":"IF(D115=\"Sieger 105\",\"Sieger 113\",IF(E115=\"Verlierer 111\",\"Sieger 113\",IF(D115=E115,\"Freilos\",IF(E115=\"Freilos\",D115,IF(D115=\"Freilos\",E115,IF(F115>G115,D115,IF(G115>F115,E115,\"Sieger 113\")))))))","v":"Sieger 113"},{"$f":"IF(D116=\"Sieger 106\",\"Sieger 114\",IF(E116=\"Verlierer 112\",\"Sieger 114\",IF(D116=E116,\"Freilos\",IF(E116=\"Freilos\",D116,IF(D116=\"Freilos\",E116,IF(F116>G116,D116,IF(G116>F116,E116,\"Sieger 114\")))))))","v":"Sieger 114"},null,null,null,null,null,null,null,"",0,0,0,0,0,0,0,0,{"$f":"IF(Auslosung_Turnierdaten!F60=\"\",\"\",52)","v":""},{"$f":"IF('SP64'!V119=\"\",\"\",Auslosung_Turnierdaten!F60)","v":""},{"$f":"IF('SP64'!V119=\"\",\"\",Auslosung_Turnierdaten!G60)","v":""},{"$f":"IF('SP64'!V119=\"\",\"\",Auslosung_Turnierdaten!H60)","v":""},{"$f":"IF('SP64'!V119=\"\",\"\",Auslosung_Turnierdaten!I60)","v":""},{"$f":"IF('SP64'!V119=\"\",\"\",'SP64'!X54)","v":""},{"$f":"IF('SP64'!V119=\"\",\"\",'SP64'!Z54)","v":""},{"$f":"IF('SP64'!V119=\"\",\"\",'SP64'!AA54)","v":""},{"$f":"IF('SP64'!V119=\"\",\"\",'SP64'!AC54)","v":""},{"$f":"IF('SP64'!V119=\"\",\"\",IF($AE$67=\"VSp\",'SP64'!AD54,'SP64'!AF54))","v":""},{"$f":"IF('SP64'!V119=\"\",\"\",IF($AF$67=\"Quot\",'SP64'!AE54,'SP64'!AG54))","v":""},{"$f":"IF($AG$67=\"BED\",'SP64'!AH54,\"\")","v":""},{"$f":"IF($AH$67=\"HS\",'SP64'!AI54,\"\")","v":""},null,null,null,null,null,null,null,0,{"$f":"IF(AND(COUNTIF(L119:L119:$L$129,L119)=1,F119+G119>0),L119 & \"-\",\"\")","v":""},"",null,null,""]
[null,null,118,{"$f":"IF(D117=\"Sieger 107\",\"Sieger 115\",IF(E117=\"Verlierer 109\",\"Sieger 115\",IF(D117=E118,\"Freilos\",IF(E118=\"Freilos\",D117,IF(D117=\"Freilos\",E117,IF(F117>G117,D117,IF(G117>F117,E117,\"Sieger 115\")))))))","v":"Sieger 115"},{"$f":"IF(D118=\"Sieger 108\",\"Sieger 116\",IF(E118=\"Verlierer 110\",\"Sieger 116\",IF(D118=E118,\"Freilos\",IF(E118=\"Freilos\",D118,IF(D118=\"Freilos\",E118,IF(F118>G118,D118,IF(G118>F118,E118,\"Sieger 116\")))))))","v":"Sieger 116"},null,null,null,null,null,null,null,"",0,0,0,0,0,0,0,0,{"$f":"IF(Auslosung_Turnierdaten!F61=\"\",\"\",53)","v":""},{"$f":"IF('SP64'!V120=\"\",\"\",Auslosung_Turnierdaten!F61)","v":""},{"$f":"IF('SP64'!V120=\"\",\"\",Auslosung_Turnierdaten!G61)","v":""},{"$f":"IF('SP64'!V120=\"\",\"\",Auslosung_Turnierdaten!H61)","v":""},{"$f":"IF('SP64'!V120=\"\",\"\",Auslosung_Turnierdaten!I61)","v":""},{"$f":"IF('SP64'!V120=\"\",\"\",'SP64'!X55)","v":""},{"$f":"IF('SP64'!V120=\"\",\"\",'SP64'!Z55)","v":""},{"$f":"IF('SP64'!V120=\"\",\"\",'SP64'!AA55)","v":""},{"$f":"IF('SP64'!V120=\"\",\"\",'SP64'!AC55)","v":""},{"$f":"IF('SP64'!V120=\"\",\"\",IF($AE$67=\"VSp\",'SP64'!AD55,'SP64'!AF55))","v":""},{"$f":"IF('SP64'!V120=\"\",\"\",IF($AF$67=\"Quot\",'SP64'!AE55,'SP64'!AG55))","v":""},{"$f":"IF($AG$67=\"BED\",'SP64'!AH55,\"\")","v":""},{"$f":"IF($AH$67=\"HS\",'SP64'!AI55,\"\")","v":""},null,null,null,null,null,null,null,0,{"$f":"IF(AND(COUNTIF(L120:L120:$L$129,L120)=1,F120+G120>0),L120 & \"-\",\"\")","v":""},"",null,null,""]
[null,"GR4",119,{"$f":"IF(D111=\"Sieger 89\",\"Sieger 109\",IF(E111=\"Sieger 90\",\"Sieger 109\",IF(D111=E111,\"Freilos\",IF(E111=\"Freilos\",D111,IF(D111=\"Freilos\",E111,IF(F111>G111,D111,IF(G111>F111,E111,\"Sieger 109\")))))))","v":"Sieger 109"},{"$f":"IF(D112=\"Sieger 91\",\"Sieger 110\",IF(E112=\"Sieger 92\",\"Sieger 110\",IF(D112=E112,\"Freilos\",IF(E112=\"Freilos\",D112,IF(D112=\"Freilos\",E112,IF(F112>G112,D112,IF(G112>F112,E112,\"Sieger 110\")))))))","v":"Sieger 110"},null,null,null,null,null,null,null,null,0,0,0,0,0,0,{"$f":"IF(E121=\"Freilos\",6,IF(F121>G121,6,0))","v":0},{"$f":"IF(D121=\"Freilos\",6,IF(G121>F121,6,0))","v":0},{"$f":"IF(Auslosung_Turnierdaten!F62=\"\",\"\",54)","v":""},{"$f":"IF('SP64'!V121=\"\",\"\",Auslosung_Turnierdaten!F62)","v":""},{"$f":"IF('SP64'!V121=\"\",\"\",Auslosung_Turnierdaten!G62)","v":""},{"$f":"IF('SP64'!V121=\"\",\"\",Auslosung_Turnierdaten!H62)","v":""},{"$f":"IF('SP64'!V121=\"\",\"\",Auslosung_Turnierdaten!I62)","v":""},{"$f":"IF('SP64'!V121=\"\",\"\",'SP64'!X56)","v":""},{"$f":"IF('SP64'!V121=\"\",\"\",'SP64'!Z56)","v":""},{"$f":"IF('SP64'!V121=\"\",\"\",'SP64'!AA56)","v":""},{"$f":"IF('SP64'!V121=\"\",\"\",'SP64'!AC56)","v":""},{"$f":"IF('SP64'!V121=\"\",\"\",IF($AE$67=\"VSp\",'SP64'!AD56,'SP64'!AF56))","v":""},{"$f":"IF('SP64'!V121=\"\",\"\",IF($AF$67=\"Quot\",'SP64'!AE56,'SP64'!AG56))","v":""},{"$f":"IF($AG$67=\"BED\",'SP64'!AH56,\"\")","v":""},{"$f":"IF($AH$67=\"HS\",'SP64'!AI56,\"\")","v":""},null,null,null,null,null,null,null,0,{"$f":"IF(AND(COUNTIF(L121:L121:$L$129,L121)=1,F121+G121>0),L121 & \"-\",\"\")","v":""},"",null,null,""]
[null,null,120,{"$f":"IF(D113=\"Sieger 93\",\"Sieger 111\",IF(E113=\"Sieger 94\",\"Sieger 111\",IF(D113=E113,\"Freilos\",IF(E113=\"Freilos\",D113,IF(D113=\"Freilos\",E113,IF(F113>G113,D113,IF(G113>F113,E113,\"Sieger 111\")))))))","v":"Sieger 111"},{"$f":"IF(D114=\"Sieger 95\",\"Sieger 112\",IF(E114=\"Sieger 96\",\"Sieger 112\",IF(D114=E114,\"Freilos\",IF(E114=\"Freilos\",D114,IF(D114=\"Freilos\",E114,IF(F114>G114,D114,IF(G114>F114,E114,\"Sieger 112\")))))))","v":"Sieger 112"},null,null,null,null,null,null,null,null,0,0,0,0,0,0,{"$f":"IF(E122=\"Freilos\",6,IF(F122>G122,6,0))","v":0},{"$f":"IF(D122=\"Freilos\",6,IF(G122>F122,6,0))","v":0},{"$f":"IF(Auslosung_Turnierdaten!F63=\"\",\"\",55)","v":""},{"$f":"IF('SP64'!V122=\"\",\"\",Auslosung_Turnierdaten!F63)","v":""},{"$f":"IF('SP64'!V122=\"\",\"\",Auslosung_Turnierdaten!G63)","v":""},{"$f":"IF('SP64'!V122=\"\",\"\",Auslosung_Turnierdaten!H63)","v":""},{"$f":"IF('SP64'!V122=\"\",\"\",Auslosung_Turnierdaten!I63)","v":""},{"$f":"IF('SP64'!V122=\"\",\"\",'SP64'!X57)","v":""},{"$f":"IF('SP64'!V122=\"\",\"\",'SP64'!Z57)","v":""},{"$f":"IF('SP64'!V122=\"\",\"\",'SP64'!AA57)","v":""},{"$f":"IF('SP64'!V122=\"\",\"\",'SP64'!AC57)","v":""},{"$f":"IF('SP64'!V122=\"\",\"\",IF($AE$67=\"VSp\",'SP64'!AD57,'SP64'!AF57))","v":""},{"$f":"IF('SP64'!V122=\"\",\"\",IF($AF$67=\"Quot\",'SP64'!AE57,'SP64'!AG57))","v":""},{"$f":"IF($AG$67=\"BED\",'SP64'!AH57,\"\")","v":""},{"$f":"IF($AH$67=\"HS\",'SP64'!AI57,\"\")","v":""},null,null,null,null,null,null,null,0,{"$f":"IF(AND(COUNTIF(L122:L122:$L$129,L122)=1,F122+G122>0),L122 & \"-\",\"\")","v":""},"",null,null,""]
[null,"VR8",121,{"$f":"IF(D119=\"Sieger 113\",\"Sieger 117\",IF(E119=\"Sieger 114\",\"Sieger 117\",IF(D119=E119,\"Freilos\",IF(E119=\"Freilos\",D119,IF(D119=\"Freilos\",E119,IF(F119>G119,D119,IF(G119>F119,E119,\"Sieger 117\")))))))","v":"Sieger 117"},{"$f":"IF(D121=\"Sieger 109\",\"Verlierer 119\",IF(E121=\"Sieger 110\",\"Verlierer 119\",IF(D121=E121,\"Freilos\",IF(E121=\"Freilos\",E121,IF(D121=\"Freilos\",D121,IF(F121>G121,E121,IF(G121>F121,D121,\"Verlierer 119\")))))))","v":"Verlierer 119"},null,null,null,null,null,null,null,{"$f":"IF(F123>G123,E123,IF(G123>F123,D123,\"\"))","v":""},0,0,{"$f":"IF(D124=\"Freilos\",0,IF(F123<G123,1,IF(F123>G123,1,0)))","v":0},{"$f":"IF(D124=\"Freilos\",0,IF(F123<G123,1,IF(F123>G123,1,0)))","v":0},{"$f":"IF(D124=\"Freilos\",0,IF(F123>G123,1,0))","v":0},{"$f":"IF(D124=\"Freilos\",0,IF(G123>F123,1,0))","v":0},0,{"$f":"IF(D124=\"Freilos\",3,IF(G123>F123,3,0))","v":0},{"$f":"IF(Auslosung_Turnierdaten!F64=\"\",\"\",56)","v":""},{"$f":"IF('SP64'!V123=\"\",\"\",Auslosung_Turnierdaten!F64)","v":""},{"$f":"IF('SP64'!V123=\"\",\"\",Auslosung_Turnierdaten!G64)","v":""},{"$f":"IF('SP64'!V123=\"\",\"\",Auslosung_Turnierdaten!H64)","v":""},{"$f":"IF('SP64'!V123=\"\",\"\",Auslosung_Turnierdaten!I64)","v":""},{"$f":"IF('SP64'!V123=\"\",\"\",'SP64'!X58)","v":""},{"$f":"IF('SP64'!V123=\"\",\"\",'SP64'!Z58)","v":""},{"$f":"IF('SP64'!V123=\"\",\"\",'SP64'!AA58)","v":""},{"$f":"IF('SP64'!V123=\"\",\"\",'SP64'!AC58)","v":""},{"$f":"IF('SP64'!V123=\"\",\"\",IF($AE$67=\"VSp\",'SP64'!AD58,'SP64'!AF58))","v":""},{"$f":"IF('SP64'!V123=\"\",\"\",IF($AF$67=\"Quot\",'SP64'!AE58,'SP64'!AG58))","v":""},{"$f":"IF($AG$67=\"BED\",'SP64'!AH58,\"\")","v":""},{"$f":"IF($AH$67=\"HS\",'SP64'!AI58,\"\")","v":""},null,null,null,null,null,null,null,0,{"$f":"IF(AND(COUNTIF(L123:L123:$L$129,L123)=1,F123+G123>0),L123 & \"-\",\"\")","v":""},"",null,null,""]
[null,null,122,{"$f":"IF(D120=\"Sieger 115\",\"Sieger 118\",IF(E120=\"Sieger 116\",\"Sieger 118\",IF(D120=E120,\"Freilos\",IF(E120=\"Freilos\",D120,IF(D120=\"Freilos\",E120,IF(F120>G120,D120,IF(G120>F120,E120,\"Sieger 118\")))))))","v":"Sieger 118"},{"$f":"IF(D122=\"Sieger 111\",\"Verlierer 120\",IF(E122=\"Sieger 112\",\"Verlierer 120\",IF(D122=E122,\"Freilos\",IF(E122=\"Freilos\",E122,IF(D122=\"Freilos\",D122,IF(F122>G122,E122,IF(G122>F122,D122,\"Verlierer 120\")))))))","v":"Verlierer 120"},null,null,null,null,null,null,null,{"$f":"IF(F124>G124,E124,IF(G124>F124,D124,\"\"))","v":""},0,0,{"$f":"IF(D123=\"Freilos\",0,IF(F124<G124,1,IF(F124>G124,1,0)))","v":0},{"$f":"IF(D123=\"Freilos\",0,IF(F124<G124,1,IF(F124>G124,1,0)))","v":0},{"$f":"IF(D123=\"Freilos\",0,IF(F124>G124,1,0))","v":0},{"$f":"IF(D123=\"Freilos\",0,IF(G124>F124,1,0))","v":0},0,{"$f":"IF(D123=\"Freilos\",3,IF(G124>F124,3,0))","v":0},{"$f":"IF(Auslosung_Turnierdaten!F65=\"\",\"\",57)","v":""},{"$f":"IF('SP64'!V124=\"\",\"\",Auslosung_Turnierdaten!F65)","v":""},{"$f":"IF('SP64'!V124=\"\",\"\",Auslosung_Turnierdaten!G65)","v":""},{"$f":"IF('SP64'!V124=\"\",\"\",Auslosung_Turnierdaten!H65)","v":""},{"$f":"IF('SP64'!V124=\"\",\"\",Auslosung_Turnierdaten!I65)","v":""},{"$f":"IF('SP64'!V124=\"\",\"\",'SP64'!X59)","v":""},{"$f":"IF('SP64'!V124=\"\",\"\",'SP64'!Z59)","v":""},{"$f":"IF('SP64'!V124=\"\",\"\",'SP64'!AA59)","v":""},{"$f":"IF('SP64'!V124=\"\",\"\",'SP64'!AC59)","v":""},{"$f":"IF('SP64'!V124=\"\",\"\",IF($AE$67=\"VSp\",'SP64'!AD59,'SP64'!AF59))","v":""},{"$f":"IF('SP64'!V124=\"\",\"\",IF($AF$67=\"Quot\",'SP64'!AE59,'SP64'!AG59))","v":""},{"$f":"IF($AG$67=\"BED\",'SP64'!AH59,\"\")","v":""},{"$f":"IF($AH$67=\"HS\",'SP64'!AI59,\"\")","v":""},null,null,null,null,null,null,null,0,{"$f":"IF(AND(COUNTIF(L124:L124:$L$129,L124)=1,F124+G124>0),L124 & \"-\",\"\")","v":""},"",null,null,""]
[null,"VR9",123,{"$f":"IF(D123=\"Sieger 117\",\"Sieger 121\",IF(E123=\"Verlierer 119\",\"Sieger 121\",IF(D123=E123,\"Freilos\",IF(E123=\"Freilos\",D123,IF(D123=\"Freilos\",E123,IF(F123>G123,D123,IF(G123>F123,E123,\"Sieger 121\")))))))","v":"Sieger 121"},{"$f":"IF(D124=\"Sieger 118\",\"Sieger 122\",IF(E124=\"Verlierer 120\",\"Sieger 122\",IF(D124=E124,\"Freilos\",IF(E124=\"Freilos\",D124,IF(D124=\"Freilos\",E124,IF(F124>G124,D124,IF(G124>F124,E124,\"Sieger 122\")))))))","v":"Sieger 122"},null,null,null,null,null,null,null,{"$f":"IF(F125>G125,E125,IF(G125>F125,D125,\"\"))","v":""},0,0,0,0,0,0,0,0,{"$f":"IF(Auslosung_Turnierdaten!F66=\"\",\"\",58)","v":""},{"$f":"IF('SP64'!V125=\"\",\"\",Auslosung_Turnierdaten!F66)","v":""},{"$f":"IF('SP64'!V125=\"\",\"\",Auslosung_Turnierdaten!G66)","v":""},{"$f":"IF('SP64'!V125=\"\",\"\",Auslosung_Turnierdaten!H66)","v":""},{"$f":"IF('SP64'!V125=\"\",\"\",Auslosung_Turnierdaten!I66)","v":""},{"$f":"IF('SP64'!V125=\"\",\"\",'SP64'!X60)","v":""},{"$f":"IF('SP64'!V125=\"\",\"\",'SP64'!Z60)","v":""},{"$f":"IF('SP64'!V125=\"\",\"\",'SP64'!AA60)","v":""},{"$f":"IF('SP64'!V125=\"\",\"\",'SP64'!AC60)","v":""},{"$f":"IF('SP64'!V125=\"\",\"\",IF($AE$67=\"VSp\",'SP64'!AD60,'SP64'!AF60))","v":""},{"$f":"IF('SP64'!V125=\"\",\"\",IF($AF$67=\"Quot\",'SP64'!AE60,'SP64'!AG60))","v":""},{"$f":"IF($AG$67=\"BED\",'SP64'!AH60,\"\")","v":""},{"$f":"IF($AH$67=\"HS\",'SP64'!AI60,\"\")","v":""},null,null,null,null,null,null,null,0,{"$f":"IF(AND(COUNTIF(L125:L125:$L$129,L125)=1,F125+G125>0),L125 & \"-\",\"\")","v":""},"",null,null,""]
[null,"GR5",124,{"$f":"IF(D121=\"Sieger 109\",\"Sieger 119\",IF(E121=\"Sieger 110\",\"Sieger 119\",IF(D121=E121,\"Freilos\",IF(E121=\"Freilos\",D121,IF(D121=\"Freilos\",E121,IF(F121>G121,D121,IF(G121>F121,E121,\"Sieger 119\")))))))","v":"Sieger 119"},{"$f":"IF(D122=\"Sieger 111\",\"Sieger 120\",IF(E122=\"Sieger 112\",\"Sieger 120\",IF(D122=E122,\"Freilos\",IF(E122=\"Freilos\",D122,IF(D122=\"Freilos\",E122,IF(F122>G122,D122,IF(G122>F122,E122,\"Sieger 120\")))))))","v":"Sieger 120"},null,null,null,null,null,null,null,null,0,0,0,0,0,0,{"$f":"IF(E126=\"Freilos\",6,IF(F126>G126,6,0))","v":0},{"$f":"IF(D126=\"Freilos\",6,IF(G126>F126,6,0))","v":0},{"$f":"IF(Auslosung_Turnierdaten!F67=\"\",\"\",59)","v":""},{"$f":"IF('SP64'!V126=\"\",\"\",Auslosung_Turnierdaten!F67)","v":""},{"$f":"IF('SP64'!V126=\"\",\"\",Auslosung_Turnierdaten!G67)","v":""},{"$f":"IF('SP64'!V126=\"\",\"\",Auslosung_Turnierdaten!H67)","v":""},{"$f":"IF('SP64'!V126=\"\",\"\",Auslosung_Turnierdaten!I67)","v":""},{"$f":"IF('SP64'!V126=\"\",\"\",'SP64'!X61)","v":""},{"$f":"IF('SP64'!V126=\"\",\"\",'SP64'!Z61)","v":""},{"$f":"IF('SP64'!V126=\"\",\"\",'SP64'!AA61)","v":""},{"$f":"IF('SP64'!V126=\"\",\"\",'SP64'!AC61)","v":""},{"$f":"IF('SP64'!V126=\"\",\"\",IF($AE$67=\"VSp\",'SP64'!AD61,'SP64'!AF61))","v":""},{"$f":"IF('SP64'!V126=\"\",\"\",IF($AF$67=\"Quot\",'SP64'!AE61,'SP64'!AG61))","v":""},{"$f":"IF($AG$67=\"BED\",'SP64'!AH61,\"\")","v":""},{"$f":"IF($AH$67=\"HS\",'SP64'!AI61,\"\")","v":""},null,null,null,null,null,null,null,0,{"$f":"IF(AND(COUNTIF(L126:L126:$L$129,L126)=1,F126+G126>0),L126 & \"-\",\"\")","v":""},"",null,null,""]
[null,"VR10",125,{"$f":"IF(D125=\"Sieger 121\",\"Sieger 123\",IF(E125=\"Sieger 122\",\"Sieger 123\",IF(D125=E125,\"Freilos\",IF(E125=\"Freilos\",D125,IF(D125=\"Freilos\",E125,IF(F125>G125,D125,IF(G125>F125,E125,\"Sieger 123\")))))))","v":"Sieger 123"},{"$f":"IF(D126=\"Sieger 119\",\"Verlierer 124\",IF(E126=\"Sieger 120\",\"Verlierer 124\",IF(D126=E126,\"Freilos\",IF(E126=\"Freilos\",E126,IF(D126=\"Freilos\",D126,IF(F126>G126,E126,IF(G126>F126,D126,\"Verlierer 124\")))))))","v":"Verlierer 124"},null,null,null,null,null,null,null,{"$f":"IF(F127>G127,E127,IF(G127>F127,D127,\"\"))","v":""},0,0,0,0,0,0,0,0,{"$f":"IF(Auslosung_Turnierdaten!F68=\"\",\"\",60)","v":""},{"$f":"IF('SP64'!V127=\"\",\"\",Auslosung_Turnierdaten!F68)","v":""},{"$f":"IF('SP64'!V127=\"\",\"\",Auslosung_Turnierdaten!G68)","v":""},{"$f":"IF('SP64'!V127=\"\",\"\",Auslosung_Turnierdaten!H68)","v":""},{"$f":"IF('SP64'!V127=\"\",\"\",Auslosung_Turnierdaten!I68)","v":""},{"$f":"IF('SP64'!V127=\"\",\"\",'SP64'!X62)","v":""},{"$f":"IF('SP64'!V127=\"\",\"\",'SP64'!Z62)","v":""},{"$f":"IF('SP64'!V127=\"\",\"\",'SP64'!AA62)","v":""},{"$f":"IF('SP64'!V127=\"\",\"\",'SP64'!AC62)","v":""},{"$f":"IF('SP64'!V127=\"\",\"\",IF($AE$67=\"VSp\",'SP64'!AD62,'SP64'!AF62))","v":""},{"$f":"IF('SP64'!V127=\"\",\"\",IF($AF$67=\"Quot\",'SP64'!AE62,'SP64'!AG62))","v":""},{"$f":"IF($AG$67=\"BED\",'SP64'!AH62,\"\")","v":""},{"$f":"IF($AH$67=\"HS\",'SP64'!AI62,\"\")","v":""},null,null,null,null,null,null,null,0,{"$f":"IF(AND(COUNTIF(L127:L127:$L$129,L127)=1,F127+G127>0),L127 & \"-\",\"\")","v":""},"",null,null,""]
[null,"Finale",126,{"$f":"IF(D126=\"Sieger 119\",\"Sieger 124\",IF(E126=\"Sieger 120\",\"Sieger 124\",IF(D126=E126,\"Freilos\",IF(E126=\"Freilos\",D126,IF(D126=\"Freilos\",E126,IF(F126>G126,D126,IF(G126>F126,E126,\"Sieger 124\")))))))","v":"Sieger 124"},{"$f":"IF(D127=\"Sieger 123\",\"Sieger 125\",IF(E127=\"Verlierer 124\",\"Sieger 125\",IF(D127=E127,\"Freilos\",IF(E127=\"Freilos\",D127,IF(D127=\"Freilos\",E127,IF(F127>G127,D127,IF(G127>F127,E127,\"Sieger 125\")))))))","v":"Sieger 125"},null,null,null,null,null,null,null,"Sieger aus 125 muß",0,0,0,0,0,0,0,0,{"$f":"IF(Auslosung_Turnierdaten!F69=\"\",\"\",61)","v":""},{"$f":"IF('SP64'!V128=\"\",\"\",Auslosung_Turnierdaten!F69)","v":""},{"$f":"IF('SP64'!V128=\"\",\"\",Auslosung_Turnierdaten!G69)","v":""},{"$f":"IF('SP64'!V128=\"\",\"\",Auslosung_Turnierdaten!H69)","v":""},{"$f":"IF('SP64'!V128=\"\",\"\",Auslosung_Turnierdaten!I69)","v":""},{"$f":"IF('SP64'!V128=\"\",\"\",'SP64'!X63)","v":""},{"$f":"IF('SP64'!V128=\"\",\"\",'SP64'!Z63)","v":""},{"$f":"IF('SP64'!V128=\"\",\"\",'SP64'!AA63)","v":""},{"$f":"IF('SP64'!V128=\"\",\"\",'SP64'!AC63)","v":""},{"$f":"IF('SP64'!V128=\"\",\"\",IF($AE$67=\"VSp\",'SP64'!AD63,'SP64'!AF63))","v":""},{"$f":"IF('SP64'!V128=\"\",\"\",IF($AF$67=\"Quot\",'SP64'!AE63,'SP64'!AG63))","v":""},{"$f":"IF($AG$67=\"BED\",'SP64'!AH63,\"\")","v":""},{"$f":"IF($AH$67=\"HS\",'SP64'!AI63,\"\")","v":""},null,null,null,null,null,null,null,0,{"$f":"IF(AND(COUNTIF(L128:L128:$L$129,L128)=1,F128+G128>0),L128 & \"-\",\"\")","v":""},"",null,null,""]
[null,"Finale",127,{"$f":"IF(D128=\"Sieger 124\",\"Sieger 126\",IF(E128=\"Sieger 125\",\"Sieger 126\",IF(D128=E128,\"Freilos\",IF(E128=\"Freilos\",D128,IF(D128=\"Freilos\",E128,IF(F128>G128,D128,IF(G128>F128,E128,\"Sieger 126\")))))))","v":"Sieger 126"},{"$f":"IF(D128=\"Sieger 124\",\"Verlierer 126\",IF(E128=\"Sieger 125\",\"Verlierer 126\",IF(D128=E128,\"Freilos\",IF(E128=\"Freilos\",D128,IF(D128=\"Freilos\",E128,IF(F128>G128,E128,IF(G128>F128,D128,\"Verlierer 126\")))))))","v":"Verlierer 126"},null,null,null,null,null,null,null,"2 x gewinnen",0,0,0,0,0,0,0,0,{"$f":"IF(Auslosung_Turnierdaten!F70=\"\",\"\",62)","v":""},{"$f":"IF('SP64'!V129=\"\",\"\",Auslosung_Turnierdaten!F70)","v":""},{"$f":"IF('SP64'!V129=\"\",\"\",Auslosung_Turnierdaten!G70)","v":""},{"$f":"IF('SP64'!V129=\"\",\"\",Auslosung_Turnierdaten!H70)","v":""},{"$f":"IF('SP64'!V129=\"\",\"\",Auslosung_Turnierdaten!I70)","v":""},{"$f":"IF('SP64'!V129=\"\",\"\",'SP64'!X64)","v":""},{"$f":"IF('SP64'!V129=\"\",\"\",'SP64'!Z64)","v":""},{"$f":"IF('SP64'!V129=\"\",\"\",'SP64'!AA64)","v":""},{"$f":"IF('SP64'!V129=\"\",\"\",'SP64'!AC64)","v":""},{"$f":"IF('SP64'!V129=\"\",\"\",IF($AE$67=\"VSp\",'SP64'!AD64,'SP64'!AF64))","v":""},{"$f":"IF('SP64'!V129=\"\",\"\",IF($AF$67=\"Quot\",'SP64'!AE64,'SP64'!AG64))","v":""},{"$f":"IF($AG$67=\"BED\",'SP64'!AH64,\"\")","v":""},{"$f":"IF($AH$67=\"HS\",'SP64'!AI64,\"\")","v":""},null,null,null,null,null,null,null,0,{"$f":"IF(AND(COUNTIF(L129:L129:$L$129,L129)=1,F129+G129>0),L129 & \"-\",\"\")","v":""},"",null,null,""]
[null,null,null,null,null,null,null,null,null,null,null,null,null,null,null,null,null,null,null,null,null,{"$f":"IF(Auslosung_Turnierdaten!F71=\"\",\"\",63)","v":""},{"$f":"IF('SP64'!V130=\"\",\"\",Auslosung_Turnierdaten!F71)","v":""},{"$f":"IF('SP64'!V130=\"\",\"\",Auslosung_Turnierdaten!G71)","v":""},{"$f":"IF('SP64'!V130=\"\",\"\",Auslosung_Turnierdaten!H71)","v":""},{"$f":"IF('SP64'!V130=\"\",\"\",Auslosung_Turnierdaten!I71)","v":""},{"$f":"IF('SP64'!V130=\"\",\"\",'SP64'!X65)","v":""},{"$f":"IF('SP64'!V130=\"\",\"\",'SP64'!Z65)","v":""},{"$f":"IF('SP64'!V130=\"\",\"\",'SP64'!AA65)","v":""},{"$f":"IF('SP64'!V130=\"\",\"\",'SP64'!AC65)","v":""},{"$f":"IF('SP64'!V130=\"\",\"\",IF($AE$67=\"VSp\",'SP64'!AD65,'SP64'!AF65))","v":""},{"$f":"IF('SP64'!V130=\"\",\"\",IF($AF$67=\"Quot\",'SP64'!AE65,'SP64'!AG65))","v":""},{"$f":"IF($AG$67=\"BED\",'SP64'!AH65,\"\")","v":""},{"$f":"IF($AH$67=\"HS\",'SP64'!AI65,\"\")","v":""}]
[null,null,null,null,null,null,null,null,null,null,null,null,null,null,null,null,null,null,null,null,null,{"$f":"IF(Auslosung_Turnierdaten!F72=\"\",\"\",64)","v":""},{"$f":"IF('SP64'!V131=\"\",\"\",Auslosung_Turnierdaten!F72)","v":""},{"$f":"IF('SP64'!V131=\"\",\"\",Auslosung_Turnierdaten!G72)","v":""},{"$f":"IF('SP64'!V131=\"\",\"\",Auslosung_Turnierdaten!H72)","v":""},{"$f":"IF('SP64'!V131=\"\",\"\",Auslosung_Turnierdaten!I72)","v":""},{"$f":"IF('SP64'!V131=\"\",\"\",'SP64'!X66)","v":""},{"$f":"IF('SP64'!V131=\"\",\"\",'SP64'!Z66)","v":""},{"$f":"IF('SP64'!V131=\"\",\"\",'SP64'!AA66)","v":""},{"$f":"IF('SP64'!V131=\"\",\"\",'SP64'!AC66)","v":""},{"$f":"IF('SP64'!V131=\"\",\"\",IF($AE$67=\"VSp\",'SP64'!AD66,'SP64'!AF66))","v":""},{"$f":"IF('SP64'!V131=\"\",\"\",IF($AF$67=\"Quot\",'SP64'!AE66,'SP64'!AG66))","v":""},{"$f":"IF($AG$67=\"BED\",'SP64'!AH66,\"\")","v":""},{"$f":"IF($AH$67=\"HS\",'SP64'!AI66,\"\")","v":""}]

{"sheet":"Viertelfinale","index":3,"n_rows":27,"n_cols":7,"rows_kept":27,"cut":false,"hidden":false,"merged":[[8,1,8,6],[15,1,15,6],[20,1,20,6],[24,1,24,6]]}
[]
[null,null,"Qualifikanten Gewinnerrunde","Qualifikanten Verliererrunde"]
[null,null,{"$f":"'SP64'!D121","v":"Sieger 109"},{"$f":"'SP64'!D119","v":"Sieger 113"}]
[null,null,{"$f":"'SP64'!E121","v":"Sieger 110"},{"$f":"'SP64'!E119","v":"Sieger 114"}]
[null,null,{"$f":"'SP64'!D122","v":"Sieger 111"},{"$f":"'SP64'!D120","v":"Sieger 115"}]
[null,null,{"$f":"'SP64'!E122","v":"Sieger 112"},{"$f":"'SP64'!E120","v":"Sieger 116"}]
[]
[]
[null,"Viertelfinale"]
[null,null,"Tln1","Tln2","Sp1","Sp2","Tisch"]
[null,117]
[null,118]
[null,119]
[null,120]
[]
[null,"Halbfinale"]
[null,null,"Tln1","Tln2","Sp1","Sp2","Tisch"]
[null,121,{"$f":"IF(E11>F11,C11,IF(F11>E11,D11,\"Sieger 117\"))","v":"Sieger 117"},{"$f":"IF(E12>F12,C12,IF(F12>E12,D12,\"Sieger 118\"))","v":"Sieger 118"}]
[null,122,{"$f":"IF(E13>F13,C13,IF(F13>E13,D13,\"Sieger 119\"))","v":"Sieger 119"},{"$f":"IF(E14>F14,C14,IF(F14>E14,D14,\"Sieger 120\"))","v":"Sieger 120"}]
[]
[null,"Spiel um Platz 3"]
[null,null,"Tln1","Tln2","Sp1","Sp2","Tisch"]
[null,123,{"$f":"IF(E18<F18,C18,IF(F18<E18,D18,\"Verlierer 121\"))","v":"Verlierer 121"},{"$f":"IF(E19<F19,C19,IF(F19<E19,D19,\"Verlierer 122\"))","v":"Verlierer 122"}]
[]
[null,"Finale"]
[null,null,"Tln1","Tln2","Sp1","Sp2","Tisch"]
[null,124,{"$f":"IF(E18>F18,C18,IF(F18>E18,D18,\"Sieger 121\"))","v":"Sieger 121"},{"$f":"IF(E19>F19,C19,IF(F19>E19,D19,\"Sieger 122\"))","v":"Sieger 122"}]

{"sheet":"Baum 64","index":4,"n_rows":65,"n_cols":34,"rows_kept":65,"cut":false,"hidden":true,"merged":[]}
[null,null,null,null,null,null,null,null,null,null,null,null,null,null,null,null,null,null,null,null,null,{"$f":"'SP64'!B3","v":"HR"}]
[null,null,null,null,null,null,null,null,null,null,null,null,null,null,null,null,null,null,{"$f":"'SP64'!B35","v":"VR1"},null,{"$f":"'SP64'!C3","v":1},{"$f":"'SP64'!D3","v":"Spieler 1"},{"$f":"'SP64'!F3","v":0},null,{"$f":"'SP64'!B51","v":"GR1"}]
[null,null,null,null,null,null,null,null,null,null,null,null,null,null,null,null,{"$f":"'SP64'!B67","v":"VR2"},{"$f":"'SP64'!C35","v":33},{"$f":"'SP64'!D35","v":"Verlierer 1"},{"$f":"'SP64'!F35","v":0},null,{"$f":"'SP64'!E3","v":"Spieler 33"},{"$f":"'SP64'!G3","v":0},{"$f":"'SP64'!C51","v":49},{"$f":"'SP64'!D51","v":"Sieger 1"},{"$f":"'SP64'!F51","v":0}]
[null,null,null,null,null,null,null,null,null,null,null,null,null,null,{"$f":"'SP64'!B83","v":"VR3"},{"$f":"'SP64'!C67","v":65},{"$f":"'SP64'!D67","v":"Sieger 33"},{"$f":"'SP64'!F67","v":0},{"$f":"'SP64'!E35","v":"Verlierer 2"},{"$f":"'SP64'!G35","v":0},{"$f":"'SP64'!C4","v":2},{"$f":"'SP64'!D4","v":"Spieler 17"},{"$f":"'SP64'!F4","v":0},null,{"$f":"'SP64'!E51","v":"Sieger 2"},{"$f":"'SP64'!G51","v":0},{"$f":"'SP64'!B91","v":"GR2"}]
[null,null,null,null,null,null,null,null,null,null,null,null,{"$f":"'SP64'!B99","v":"VR4"},{"$f":"'SP64'!C83","v":81},{"$f":"'SP64'!D83","v":"Sieger 65"},{"$f":"'SP64'!F83","v":0},{"$f":"'SP64'!E67","v":"Verlierer 64"},{"$f":"'SP64'!G67","v":0},"Pl. 49-64",null,null,{"$f":"'SP64'!E4","v":"Spieler 49"},{"$f":"'SP64'!G4","v":0},null,"V. nach 80",{"$f":"'SP64'!C91","v":89},{"$f":"'SP64'!D91","v":"Sieger 49"},{"$f":"'SP64'!F91","v":0}]
[null,null,null,null,null,null,null,null,null,null,null,{"$f":"'SP64'!C99","v":97},{"$f":"'SP64'!D99","v":"Sieger 81"},{"$f":"'SP64'!F99","v":0},{"$f":"'SP64'!E83","v":"Sieger 66"},{"$f":"'SP64'!G83","v":0},"Pl. 33-48",null,null,null,{"$f":"'SP64'!C5","v":3},{"$f":"'SP64'!D5","v":"Spieler 9"},{"$f":"'SP64'!F5","v":0},null,null,null,{"$f":"'SP64'!E91","v":"Sieger 50"},{"$f":"'SP64'!G91","v":0}]
[null,null,null,null,null,null,null,null,null,null,null,null,{"$f":"'SP64'!E99","v":"Verlierer 92"},{"$f":"'SP64'!G99","v":0},"Pl. 25-32",null,null,{"$f":"'SP64'!C36","v":34},{"$f":"'SP64'!D36","v":"Verlierer 3"},{"$f":"'SP64'!F36","v":0},null,{"$f":"'SP64'!E5","v":"Spieler 41"},{"$f":"'SP64'!G5","v":0},{"$f":"'SP64'!C52","v":50},{"$f":"'SP64'!D52","v":"Sieger 3"},{"$f":"'SP64'!F52","v":0},"Verlierer nach 100"]
[null,null,null,null,null,null,null,null,null,null,null,null,"Pl. 17-24",null,null,{"$f":"'SP64'!C68","v":66},{"$f":"'SP64'!D68","v":"Sieger 34"},{"$f":"'SP64'!F68","v":0},{"$f":"'SP64'!E36","v":"Verlierer 4"},{"$f":"'SP64'!G36","v":0},{"$f":"'SP64'!C6","v":4},{"$f":"'SP64'!D6","v":"Spieler 25"},{"$f":"'SP64'!F6","v":0},null,{"$f":"'SP64'!E52","v":"Sieger 4"},{"$f":"'SP64'!G52","v":0},null,null,{"$f":"'SP64'!B111","v":"GR3"}]
[null,null,null,null,null,null,null,null,null,null,{"$f":"'SP64'!B107","v":"VR5"},null,null,null,null,null,{"$f":"'SP64'!E68","v":"Verlierer 63"},{"$f":"'SP64'!G68","v":0},null,null,null,{"$f":"'SP64'!E6","v":"Spieler 57"},{"$f":"'SP64'!G6","v":0},null,"V. nach 79",null,null,{"$f":"'SP64'!C111","v":109},{"$f":"'SP64'!D111","v":"Sieger 89"},{"$f":"'SP64'!F111","v":0}]
[null,null,null,null,null,null,null,null,{"$f":"'SP64'!B115","v":"VR6"},{"$f":"'SP64'!C107","v":105},{"$f":"'SP64'!D107","v":"Sieger 97"},{"$f":"'SP64'!F107","v":0},null,null,null,null,null,null,null,null,{"$f":"'SP64'!C7","v":5},{"$f":"'SP64'!D7","v":"Spieler 5"},{"$f":"'SP64'!F7","v":0},null,null,null,null,null,{"$f":"'SP64'!E111","v":"Sieger 90"},{"$f":"'SP64'!G111","v":0}]
[null,null,null,null,null,null,null,{"$f":"'SP64'!C115","v":113},{"$f":"'SP64'!D115","v":"Sieger 105"},{"$f":"'SP64'!F115","v":0},{"$f":"'SP64'!E107","v":"Sieger 98"},{"$f":"'SP64'!G107","v":0},null,null,null,null,null,{"$f":"'SP64'!C37","v":35},{"$f":"'SP64'!D37","v":"Verlierer 5"},{"$f":"'SP64'!F37","v":0},null,{"$f":"'SP64'!E7","v":"Spieler 37"},{"$f":"'SP64'!G7","v":0},{"$f":"'SP64'!C53","v":51},{"$f":"'SP64'!D53","v":"Sieger 5"},{"$f":"'SP64'!F53","v":0},null,null,"Verlierer nach 115"]
[null,null,null,null,null,null,null,null,{"$f":"'SP64'!E115","v":"Verlierer 111"},{"$f":"'SP64'!G115","v":0},"Pl. 13-16",null,null,null,null,{"$f":"'SP64'!C69","v":67},{"$f":"'SP64'!D69","v":"Sieger 35"},{"$f":"'SP64'!F69","v":0},{"$f":"'SP64'!E37","v":"Verlierer 6"},{"$f":"'SP64'!G37","v":0},{"$f":"'SP64'!C8","v":6},{"$f":"'SP64'!D8","v":"Spieler 21"},{"$f":"'SP64'!F8","v":0},null,{"$f":"'SP64'!E53","v":"Sieger 6"},{"$f":"'SP64'!G53","v":0}]
[null,null,null,null,null,null,null,null,"Pl. 9-12",null,null,null,null,{"$f":"'SP64'!C84","v":82},{"$f":"'SP64'!D84","v":"Sieger 67"},{"$f":"'SP64'!F84","v":0},{"$f":"'SP64'!E69","v":"Verlierer 62"},{"$f":"'SP64'!G69","v":0},null,null,null,{"$f":"'SP64'!E8","v":"Spieler 53"},{"$f":"'SP64'!G8","v":0},null,"V. nach 78",{"$f":"'SP64'!C92","v":90},{"$f":"'SP64'!D92","v":"Sieger 51"},{"$f":"'SP64'!F92","v":0}]
[null,null,null,null,null,null,null,null,null,null,null,{"$f":"'SP64'!C100","v":98},{"$f":"'SP64'!D100","v":"Sieger 82"},{"$f":"'SP64'!F100","v":0},{"$f":"'SP64'!E84","v":"Sieger 68"},{"$f":"'SP64'!G84","v":0},null,null,null,null,{"$f":"'SP64'!C9","v":7},{"$f":"'SP64'!D9","v":"Spieler 13"},{"$f":"'SP64'!F9","v":0},null,null,null,{"$f":"'SP64'!E92","v":"Sieger 52"},{"$f":"'SP64'!G92","v":0}]
[null,null,null,null,null,null,null,null,null,null,null,null,{"$f":"'SP64'!E100","v":"Verlierer 91"},{"$f":"'SP64'!G100","v":0},null,null,null,{"$f":"'SP64'!C38","v":36},{"$f":"'SP64'!D38","v":"Verlierer 7"},{"$f":"'SP64'!F38","v":0},null,{"$f":"'SP64'!E9","v":"Spieler 45"},{"$f":"'SP64'!G9","v":0},{"$f":"'SP64'!C54","v":52},{"$f":"'SP64'!D54","v":"Sieger 7"},{"$f":"'SP64'!F54","v":0},"Verlierer nach 99"]
[null,null,null,null,null,null,null,null,null,null,null,null,null,null,null,{"$f":"'SP64'!C70","v":68},{"$f":"'SP64'!D70","v":"Sieger 36"},{"$f":"'SP64'!F70","v":0},{"$f":"'SP64'!E38","v":"Verlierer 8"},{"$f":"'SP64'!G38","v":0},{"$f":"'SP64'!C10","v":8},{"$f":"'SP64'!D10","v":"Spieler 29"},{"$f":"'SP64'!F10","v":0},null,{"$f":"'SP64'!E54","v":"Sieger 8"},{"$f":"'SP64'!G54","v":0},null,null,null,null,{"$f":"'SP64'!B121","v":"GR4"}]
[null,null,null,null,null,null,{"$f":"'SP64'!B119","v":"VR7"},null,null,null,null,null,null,null,null,null,{"$f":"'SP64'!E70","v":"Verlierer 61"},{"$f":"'SP64'!G70","v":0},null,null,null,{"$f":"'SP64'!E10","v":"Spieler 61"},{"$f":"'SP64'!G10","v":0},null,"V. nach 77",null,null,null,null,{"$f":"'SP64'!C121","v":119},{"$f":"'SP64'!D121","v":"Sieger 109"},{"$f":"'SP64'!F121","v":0}]
[null,null,null,null,{"$f":"'SP64'!B123","v":"VR8"},{"$f":"'SP64'!C119","v":117},{"$f":"'SP64'!D119","v":"Sieger 113"},{"$f":"'SP64'!F119","v":0},null,null,null,null,null,null,null,null,null,null,null,null,{"$f":"'SP64'!C11","v":9},{"$f":"'SP64'!D11","v":"Spieler 3"},{"$f":"'SP64'!F11","v":0},null,null,null,null,null,null,null,{"$f":"'SP64'!E121","v":"Sieger 110"},{"$f":"'SP64'!G121","v":0}]
[null,null,null,{"$f":"'SP64'!C123","v":121},{"$f":"'SP64'!D123","v":"Sieger 117"},{"$f":"'SP64'!F123","v":0},{"$f":"'SP64'!E119","v":"Sieger 114"},{"$f":"'SP64'!G119","v":0},null,null,null,null,null,null,null,null,null,{"$f":"'SP64'!C39","v":37},{"$f":"'SP64'!D39","v":"Verlierer 9"},{"$f":"'SP64'!F39","v":0},null,{"$f":"'SP64'!E11","v":"Spieler 35"},{"$f":"'SP64'!G11","v":0},{"$f":"'SP64'!C55","v":53},{"$f":"'SP64'!D55","v":"Sieger 9"},{"$f":"'SP64'!F55","v":0},null,null,null,null,"Verlierer nach 121"]
[null,null,null,null,{"$f":"'SP64'!E123","v":"Verlierer 119"},{"$f":"'SP64'!G123","v":0},"Pl. 7-8",null,null,null,null,null,null,null,null,{"$f":"'SP64'!C71","v":69},{"$f":"'SP64'!D71","v":"Sieger 37"},{"$f":"'SP64'!F71","v":0},{"$f":"'SP64'!E39","v":"Verlierer 10"},{"$f":"'SP64'!G39","v":0},{"$f":"'SP64'!C12","v":10},{"$f":"'SP64'!D12","v":"Spieler 19"},{"$f":"'SP64'!F12","v":0},null,{"$f":"'SP64'!E55","v":"Sieger 10"},{"$f":"'SP64'!G55","v":0}]
[null,null,null,null,"Pl. 5-6",null,null,null,null,null,null,null,null,{"$f":"'SP64'!C85","v":83},{"$f":"'SP64'!D85","v":"Sieger 69"},{"$f":"'SP64'!F85","v":0},{"$f":"'SP64'!E71","v":"Verlierer 60"},{"$f":"'SP64'!G71","v":0},null,null,null,{"$f":"'SP64'!E12","v":"Spieler 51"},{"$f":"'SP64'!G12","v":0},null,"V. nach 76",{"$f":"'SP64'!C93","v":91},{"$f":"'SP64'!D93","v":"Sieger 53"},{"$f":"'SP64'!F93","v":0}]
[null,null,null,null,null,null,null,null,null,null,null,{"$f":"'SP64'!C101","v":99},{"$f":"'SP64'!D101","v":"Sieger 83"},{"$f":"'SP64'!F101","v":0},{"$f":"'SP64'!E85","v":"Sieger 70"},{"$f":"'SP64'!G85","v":0},null,null,null,null,{"$f":"'SP64'!C13","v":11},{"$f":"'SP64'!D13","v":"Spieler 11"},{"$f":"'SP64'!F13","v":0},null,null,null,{"$f":"'SP64'!E93","v":"Sieger 54"},{"$f":"'SP64'!G93","v":0}]
[null,null,null,null,null,null,null,null,null,null,null,null,{"$f":"'SP64'!E101","v":"Verlierer 90"},{"$f":"'SP64'!G101","v":0},null,null,null,{"$f":"'SP64'!C40","v":38},{"$f":"'SP64'!D40","v":"Verlierer 11"},{"$f":"'SP64'!F40","v":0},null,{"$f":"'SP64'!E13","v":"Spieler 43"},{"$f":"'SP64'!G13","v":0},{"$f":"'SP64'!C56","v":54},{"$f":"'SP64'!D56","v":"Sieger 11"},{"$f":"'SP64'!F56","v":0},"Verlierer nach 98"]
[null,null,null,null,null,null,null,null,null,null,null,null,null,null,null,{"$f":"'SP64'!C72","v":70},{"$f":"'SP64'!D72","v":"Sieger 38"},{"$f":"'SP64'!F72","v":0},{"$f":"'SP64'!E40","v":"Verlierer 12"},{"$f":"'SP64'!G40","v":0},{"$f":"'SP64'!C14","v":12},{"$f":"'SP64'!D14","v":"Spieler 27"},{"$f":"'SP64'!F14","v":0},null,{"$f":"'SP64'!E56","v":"Sieger 12"},{"$f":"'SP64'!G56","v":0}]
[null,null,null,null,null,null,null,null,null,null,null,null,null,null,null,null,{"$f":"'SP64'!E72","v":"Verlierer 59"},{"$f":"'SP64'!G72","v":0},null,null,null,{"$f":"'SP64'!E14","v":"Spieler 59"},{"$f":"'SP64'!G14","v":0},null,"V. nach 75",null,null,{"$f":"'SP64'!C112","v":110},{"$f":"'SP64'!D112","v":"Sieger 91"},{"$f":"'SP64'!F112","v":0}]
[null,null,null,null,null,null,null,null,null,{"$f":"'SP64'!C108","v":106},{"$f":"'SP64'!D108","v":"Sieger 99"},{"$f":"'SP64'!F108","v":0},null,null,null,null,null,null,null,null,{"$f":"'SP64'!C15","v":13},{"$f":"'SP64'!D15","v":"Spieler 7"},{"$f":"'SP64'!F15","v":0},null,null,null,null,null,{"$f":"'SP64'!E112","v":"Sieger 92"},{"$f":"'SP64'!G112","v":0}]
[null,null,null,null,null,null,null,{"$f":"'SP64'!C116","v":114},{"$f":"'SP64'!D116","v":"Sieger 106"},{"$f":"'SP64'!F116","v":0},{"$f":"'SP64'!E108","v":"Sieger 100"},{"$f":"'SP64'!G108","v":0},null,null,null,null,null,{"$f":"'SP64'!C41","v":39},{"$f":"'SP64'!D41","v":"Verlierer 13"},{"$f":"'SP64'!F41","v":0},null,{"$f":"'SP64'!E15","v":"Spieler 39"},{"$f":"'SP64'!G15","v":0},{"$f":"'SP64'!C57","v":55},{"$f":"'SP64'!D57","v":"Sieger 13"},{"$f":"'SP64'!F57","v":0},null,null,"Verlierer nach 116"]
[null,null,null,null,null,null,null,null,{"$f":"'SP64'!E116","v":"Verlierer 112"},{"$f":"'SP64'!G116","v":0},null,null,null,null,null,{"$f":"'SP64'!C73","v":71},{"$f":"'SP64'!D73","v":"Sieger 39"},{"$f":"'SP64'!F73","v":0},{"$f":"'SP64'!E41","v":"Verlierer 14"},{"$f":"'SP64'!G41","v":0},{"$f":"'SP64'!C16","v":14},{"$f":"'SP64'!D16","v":"Spieler 23"},{"$f":"'SP64'!F16","v":0},null,{"$f":"'SP64'!E57","v":"Sieger 14"},{"$f":"'SP64'!G57","v":0}]
[null,null,null,null,null,null,null,null,null,null,null,null,null,{"$f":"'SP64'!C86","v":84},{"$f":"'SP64'!D86","v":"Sieger 71"},{"$f":"'SP64'!F86","v":0},{"$f":"'SP64'!E73","v":"Verlierer 58"},{"$f":"'SP64'!G73","v":0},null,null,null,{"$f":"'SP64'!E16","v":"Spieler 55"},{"$f":"'SP64'!G16","v":0},null,"V. nach 74",{"$f":"'SP64'!C94","v":92},{"$f":"'SP64'!D94","v":"Sieger 55"},{"$f":"'SP64'!F94","v":0}]
[null,null,null,null,null,null,null,null,null,null,null,{"$f":"'SP64'!C102","v":100},{"$f":"'SP64'!D102","v":"Sieger 84"},{"$f":"'SP64'!F102","v":0},{"$f":"'SP64'!E86","v":"Sieger 72"},{"$f":"'SP64'!G86","v":0},null,null,null,null,{"$f":"'SP64'!C17","v":15},{"$f":"'SP64'!D17","v":"Spieler 15"},{"$f":"'SP64'!F17","v":0},null,null,null,{"$f":"'SP64'!E94","v":"Sieger 56"},{"$f":"'SP64'!G94","v":0}]
[null,null,null,null,null,null,null,null,null,null,null,null,{"$f":"'SP64'!E102","v":"Verlierer 89"},{"$f":"'SP64'!G102","v":0},null,null,null,{"$f":"'SP64'!C42","v":40},{"$f":"'SP64'!D42","v":"Verlierer 15"},{"$f":"'SP64'!F42","v":0},null,{"$f":"'SP64'!E17","v":"Spieler 47"},{"$f":"'SP64'!G17","v":0},{"$f":"'SP64'!C58","v":56},{"$f":"'SP64'!D58","v":"Sieger 15"},{"$f":"'SP64'!F58","v":0},"Verlierer nach 97"]
[null,null,null,null,null,null,null,null,null,null,null,null,null,null,null,{"$f":"'SP64'!C74","v":72},{"$f":"'SP64'!D74","v":"Sieger 40"},{"$f":"'SP64'!F74","v":0},{"$f":"'SP64'!E42","v":"Verlierer 16"},{"$f":"'SP64'!G42","v":0},{"$f":"'SP64'!C18","v":16},{"$f":"'SP64'!D18","v":"Spieler 31"},{"$f":"'SP64'!F18","v":0},null,{"$f":"'SP64'!E58","v":"Sieger 16"},{"$f":"'SP64'!G58","v":0},null,null,null,null,null,null,{"$f":"'SP64'!B126","v":"GR5"}]
[null,null,null,null,null,null,null,null,null,null,null,null,null,null,null,null,{"$f":"'SP64'!E74","v":"Verlierer 57"},{"$f":"'SP64'!G74","v":0},null,null,null,{"$f":"'SP64'!E18","v":"Spieler 63"},{"$f":"'SP64'!G18","v":0},null,"V. nach 73",null,null,null,null,null,null,124,{"$f":"'SP64'!D126","v":"Sieger 119"},{"$f":"'SP64'!F126","v":0}]
[null,null,{"$f":"'SP64'!B125","v":"VR9"},null,null,null,null,null,null,null,null,null,null,null,null,null,null,null,null,null,{"$f":"'SP64'!C19","v":17},{"$f":"'SP64'!D19","v":"Spieler 2"},{"$f":"'SP64'!F19","v":0},null,null,null,null,null,null,null,null,null,{"$f":"'SP64'!E126","v":"Sieger 120"},{"$f":"'SP64'!G126","v":0}]
[null,{"$f":"'SP64'!C125","v":123},{"$f":"'SP64'!D125","v":"Sieger 121"},{"$f":"'SP64'!F125","v":0},null,null,null,null,null,null,null,null,null,null,null,null,null,{"$f":"'SP64'!C43","v":41},{"$f":"'SP64'!D43","v":"Verlierer 17"},{"$f":"'SP64'!F43","v":0},null,{"$f":"'SP64'!E19","v":"Spieler 34"},{"$f":"'SP64'!G19","v":0},{"$f":"'SP64'!C59","v":57},{"$f":"'SP64'!D59","v":"Sieger 17"},{"$f":"'SP64'!F59","v":0},null,null,null,null,null,null,"Verlierer nach 125"]
[null,null,{"$f":"'SP64'!E125","v":"Sieger 122"},{"$f":"'SP64'!G125","v":0},null,null,null,null,null,null,null,null,null,null,null,{"$f":"'SP64'!C75","v":73},{"$f":"'SP64'!D75","v":"Sieger 41"},{"$f":"'SP64'!F75","v":0},{"$f":"'SP64'!E43","v":"Verlierer 18"},{"$f":"'SP64'!G43","v":0},{"$f":"'SP64'!C20","v":18},{"$f":"'SP64'!D20","v":"Spieler 18"},{"$f":"'SP64'!F20","v":0},null,{"$f":"'SP64'!E59","v":"Sieger 18"},{"$f":"'SP64'!G59","v":0}]
[null,null,"Pl. 4",null,null,null,null,null,null,null,null,null,null,{"$f":"'SP64'!C87","v":85},{"$f":"'SP64'!D87","v":"Sieger 73"},{"$f":"'SP64'!F87","v":0},{"$f":"'SP64'!E75","v":"Verlierer 56"},{"$f":"'SP64'!G75","v":0},null,null,null,{"$f":"'SP64'!E20","v":"Spieler 50"},{"$f":"'SP64'!G20","v":0},null,"V. nach 72",{"$f":"'SP64'!C95","v":93},{"$f":"'SP64'!D95","v":"Sieger 57"},{"$f":"'SP64'!F95","v":0}]
[null,null,null,null,null,null,null,null,null,null,null,{"$f":"'SP64'!C103","v":101},{"$f":"'SP64'!D103","v":"Sieger 85"},{"$f":"'SP64'!F103","v":0},{"$f":"'SP64'!E87","v":"Sieger 74"},{"$f":"'SP64'!G87","v":0},null,null,null,null,{"$f":"'SP64'!C21","v":19},{"$f":"'SP64'!D21","v":"Spieler 10"},{"$f":"'SP64'!F21","v":0},null,null,null,{"$f":"'SP64'!E95","v":"Sieger 58"},{"$f":"'SP64'!G95","v":0}]
[null,null,null,null,null,null,null,null,null,null,null,null,{"$f":"'SP64'!E103","v":"Verlierer 96"},{"$f":"'SP64'!G103","v":0},null,null,null,{"$f":"'SP64'!C44","v":42},{"$f":"'SP64'!D44","v":"Verlierer 19"},{"$f":"'SP64'!F44","v":0},null,{"$f":"'SP64'!E21","v":"Spieler 42"},{"$f":"'SP64'!G21","v":0},{"$f":"'SP64'!C60","v":58},{"$f":"'SP64'!D60","v":"Sieger 19"},{"$f":"'SP64'!F60","v":0},"Verlierer nach 104"]
[null,null,null,null,null,null,null,null,null,null,null,null,null,null,null,{"$f":"'SP64'!C76","v":74},{"$f":"'SP64'!D76","v":"Sieger 42"},{"$f":"'SP64'!F76","v":0},{"$f":"'SP64'!E44","v":"Verlierer 20"},{"$f":"'SP64'!G44","v":0},{"$f":"'SP64'!C22","v":20},{"$f":"'SP64'!D22","v":"Spieler 26"},{"$f":"'SP64'!F22","v":0},null,{"$f":"'SP64'!E60","v":"Sieger 20"},{"$f":"'SP64'!G60","v":0}]
[null,null,null,null,null,null,null,null,null,null,null,null,null,null,null,null,{"$f":"'SP64'!E76","v":"Verlierer 55"},{"$f":"'SP64'!G76","v":0},null,null,null,{"$f":"'SP64'!E22","v":"Spieler 58"},{"$f":"'SP64'!G22","v":0},null,"V. nach 71",null,null,{"$f":"'SP64'!C113","v":111},{"$f":"'SP64'!D113","v":"Sieger 93"},{"$f":"'SP64'!F113","v":0}]
[null,null,null,null,null,null,null,null,null,{"$f":"'SP64'!C109","v":107},{"$f":"'SP64'!D109","v":"Sieger 101"},{"$f":"'SP64'!F109","v":0},null,null,null,null,null,null,null,null,{"$f":"'SP64'!C23","v":21},{"$f":"'SP64'!D23","v":"Spieler 6"},{"$f":"'SP64'!F23","v":0},null,null,null,null,null,{"$f":"'SP64'!E113","v":"Sieger 94"},{"$f":"'SP64'!G113","v":0}]
[null,null,null,null,null,null,null,{"$f":"'SP64'!C117","v":115},{"$f":"'SP64'!D117","v":"Sieger 107"},{"$f":"'SP64'!F117","v":0},{"$f":"'SP64'!E109","v":"Sieger 102"},{"$f":"'SP64'!G109","v":0},null,null,null,null,null,{"$f":"'SP64'!C45","v":43},{"$f":"'SP64'!D45","v":"Verlierer 21"},{"$f":"'SP64'!F45","v":0},null,{"$f":"'SP64'!E23","v":"Spieler 38"},{"$f":"'SP64'!G23","v":0},{"$f":"'SP64'!C61","v":59},{"$f":"'SP64'!D61","v":"Sieger 21"},{"$f":"'SP64'!F61","v":0},null,null,"Verlierer nach 113"]
[null,null,null,null,null,null,null,null,{"$f":"'SP64'!E117","v":"Verlierer 109"},{"$f":"'SP64'!G117","v":0},null,null,null,null,null,{"$f":"'SP64'!C77","v":75},{"$f":"'SP64'!D77","v":"Sieger 43"},{"$f":"'SP64'!F77","v":0},{"$f":"'SP64'!E45","v":"Verlierer 22"},{"$f":"'SP64'!G45","v":0},{"$f":"'SP64'!C24","v":22},{"$f":"'SP64'!D24","v":"Spieler 22"},{"$f":"'SP64'!F24","v":0},null,{"$f":"'SP64'!E61","v":"Sieger 22"},{"$f":"'SP64'!G61","v":0}]
[null,null,null,null,null,null,null,null,null,null,null,null,null,{"$f":"'SP64'!C88","v":86},{"$f":"'SP64'!D88","v":"Sieger 75"},{"$f":"'SP64'!F88","v":0},{"$f":"'SP64'!E77","v":"Verlierer 54"},{"$f":"'SP64'!G77","v":0},null,null,null,{"$f":"'SP64'!E24","v":"Spieler 54"},{"$f":"'SP64'!G24","v":0},null,"V. nach 70",{"$f":"'SP64'!C96","v":94},{"$f":"'SP64'!D96","v":"Sieger 59"},{"$f":"'SP64'!F96","v":0}]
[null,null,null,null,null,null,null,null,null,null,null,{"$f":"'SP64'!C104","v":102},{"$f":"'SP64'!D104","v":"Sieger 86"},{"$f":"'SP64'!F104","v":0},{"$f":"'SP64'!E88","v":"Sieger 76"},{"$f":"'SP64'!G88","v":0},null,null,null,null,{"$f":"'SP64'!C25","v":23},{"$f":"'SP64'!D25","v":"Spieler 14"},{"$f":"'SP64'!F25","v":0},null,null,null,{"$f":"'SP64'!E96","v":"Sieger 60"},{"$f":"'SP64'!G96","v":0}]
[null,null,null,null,null,null,null,null,null,null,null,null,{"$f":"'SP64'!E104","v":"Verlierer 95"},{"$f":"'SP64'!G104","v":0},null,null,null,{"$f":"'SP64'!C46","v":44},{"$f":"'SP64'!D46","v":"Verlierer 23"},{"$f":"'SP64'!F46","v":0},null,{"$f":"'SP64'!E25","v":"Spieler 46"},{"$f":"'SP64'!G25","v":0},{"$f":"'SP64'!C62","v":60},{"$f":"'SP64'!D62","v":"Sieger 23"},{"$f":"'SP64'!F62","v":0},"Verlierer nach 103"]
[null,null,null,null,null,null,null,null,null,null,null,null,null,null,null,{"$f":"'SP64'!C78","v":76},{"$f":"'SP64'!D78","v":"Sieger 44"},{"$f":"'SP64'!F78","v":0},{"$f":"'SP64'!E46","v":"Verlierer 24"},{"$f":"'SP64'!G46","v":0},{"$f":"'SP64'!C26","v":24},{"$f":"'SP64'!D26","v":"Spieler 30"},{"$f":"'SP64'!F26","v":0},null,{"$f":"'SP64'!E62","v":"Sieger 24"},{"$f":"'SP64'!G62","v":0}]
[null,null,null,null,null,null,null,null,null,null,null,null,null,null,null,null,{"$f":"'SP64'!E78","v":"Verlierer 53"},{"$f":"'SP64'!G78","v":0},null,null,null,{"$f":"'SP64'!E26","v":"Spieler 62"},{"$f":"'SP64'!G26","v":0},null,"V. nach 69",null,null,null,null,{"$f":"'SP64'!C122","v":120},{"$f":"'SP64'!D122","v":"Sieger 111"},{"$f":"'SP64'!F122","v":0}]
[null,null,null,null,null,{"$f":"'SP64'!C120","v":118},{"$f":"'SP64'!D120","v":"Sieger 115"},{"$f":"'SP64'!F120","v":0},null,null,null,null,null,null,null,null,null,null,null,null,{"$f":"'SP64'!C27","v":25},{"$f":"'SP64'!D27","v":"Spieler 4"},{"$f":"'SP64'!F27","v":0},null,null,null,null,null,null,null,{"$f":"'SP64'!E122","v":"Sieger 112"},{"$f":"'SP64'!G122","v":0}]
[null,null,null,{"$f":"'SP64'!C124","v":122},{"$f":"'SP64'!D124","v":"Sieger 118"},{"$f":"'SP64'!F124","v":0},{"$f":"'SP64'!E120","v":"Sieger 116"},{"$f":"'SP64'!G120","v":0},null,null,null,null,null,null,null,null,null,{"$f":"'SP64'!C47","v":45},{"$f":"'SP64'!D47","v":"Verlierer 25"},{"$f":"'SP64'!F47","v":0},null,{"$f":"'SP64'!E27","v":"Spieler 36"},{"$f":"'SP64'!G27","v":0},{"$f":"'SP64'!C63","v":61},{"$f":"'SP64'!D63","v":"Sieger 25"},{"$f":"'SP64'!F63","v":0},null,null,null,null,"Verlierer nach 122"]
[null,null,null,null,{"$f":"'SP64'!E124","v":"Verlierer 120"},{"$f":"'SP64'!G124","v":0},null,null,null,null,null,null,null,null,null,{"$f":"'SP64'!C79","v":77},{"$f":"'SP64'!D79","v":"Sieger 45"},{"$f":"'SP64'!F79","v":0},{"$f":"'SP64'!E47","v":"Verlierer 26"},{"$f":"'SP64'!G47","v":0},{"$f":"'SP64'!C28","v":26},{"$f":"'SP64'!D28","v":"Spieler 20"},{"$f":"'SP64'!F28","v":0},null,{"$f":"'SP64'!E63","v":"Sieger 26"},{"$f":"'SP64'!G63","v":0},null,null,null,null,null,null,{"$f":"'SP64'!B128","v":"Finale"}]
[null,null,null,null,null,null,null,null,null,null,null,null,null,{"$f":"'SP64'!C89","v":87},{"$f":"'SP64'!D89","v":"Sieger 77"},{"$f":"'SP64'!F89","v":0},{"$f":"'SP64'!E79","v":"Verlierer 52"},{"$f":"'SP64'!G79","v":0},null,null,null,{"$f":"'SP64'!E28","v":"Spieler 52"},{"$f":"'SP64'!G28","v":0},null,"V. nach 68",{"$f":"'SP64'!C97","v":95},{"$f":"'SP64'!D97","v":"Sieger 61"},{"$f":"'SP64'!F97","v":0},null,null,null,{"$f":"'SP64'!C128","v":126},{"$f":"'SP64'!D128","v":"Sieger 124"},{"$f":"'SP64'!F128","v":0}]
[null,null,null,null,null,null,null,null,null,null,null,{"$f":"'SP64'!C105","v":103},{"$f":"'SP64'!D105","v":"Sieger 87"},{"$f":"'SP64'!F105","v":0},{"$f":"'SP64'!E89","v":"Sieger 78"},{"$f":"'SP64'!G89","v":0},null,null,null,null,{"$f":"'SP64'!C29","v":27},{"$f":"'SP64'!D29","v":"Spieler 12"},{"$f":"'SP64'!F29","v":0},null,null,null,{"$f":"'SP64'!E97","v":"Sieger 62"},{"$f":"'SP64'!G97","v":0},null,null,null,null,{"$f":"'SP64'!E128","v":"Sieger 125"},{"$f":"'SP64'!G128","v":0}]
[null,null,{"$f":"'SP64'!B127","v":"VR10"},null,null,null,null,null,null,null,null,null,{"$f":"'SP64'!E105","v":"Verlierer 94"},{"$f":"'SP64'!G105","v":0},null,null,null,{"$f":"'SP64'!C48","v":46},{"$f":"'SP64'!D48","v":"Verlierer 27"},{"$f":"'SP64'!F48","v":0},null,{"$f":"'SP64'!E29","v":"Spieler 44"},{"$f":"'SP64'!G29","v":0},{"$f":"'SP64'!C64","v":62},{"$f":"'SP64'!D64","v":"Sieger 27"},{"$f":"'SP64'!F64","v":0},"Verlierer nach 102"]
[null,125,{"$f":"'SP64'!D127","v":"Sieger 123"},{"$f":"'SP64'!F127","v":0},null,null,null,null,null,null,null,null,null,null,null,{"$f":"'SP64'!C80","v":78},{"$f":"'SP64'!D80","v":"Sieger 46"},{"$f":"'SP64'!F80","v":0},{"$f":"'SP64'!E48","v":"Verlierer 28"},{"$f":"'SP64'!G48","v":0},{"$f":"'SP64'!C30","v":28},{"$f":"'SP64'!D30","v":"Spieler 28"},{"$f":"'SP64'!F30","v":0},null,{"$f":"'SP64'!E64","v":"Sieger 28"},{"$f":"'SP64'!G64","v":0},null,null,null,null,null,null,{"$f":"'SP64'!B129","v":"Finale"}]
[null,null,{"$f":"'SP64'!E127","v":"Verlierer 124"},{"$f":"'SP64'!G127","v":0},null,null,null,null,null,null,null,null,null,null,null,null,{"$f":"'SP64'!E80","v":"Verlierer 51"},{"$f":"'SP64'!G80","v":0},null,null,null,{"$f":"'SP64'!E30","v":"Spieler 60"},{"$f":"'SP64'!G30","v":0},null,"V. nach 67",null,null,{"$f":"'SP64'!C114","v":112},{"$f":"'SP64'!D114","v":"Sieger 95"},{"$f":"'SP64'!F114","v":0},null,{"$f":"'SP64'!C129","v":127},{"$f":"'SP64'!D129","v":"Sieger 126"},{"$f":"'SP64'!F129","v":0}]
[null,null,"Gewinner nach 126",null,null,null,null,null,null,{"$f":"'SP64'!C110","v":108},{"$f":"'SP64'!D110","v":"Sieger 103"},{"$f":"'SP64'!F110","v":0},null,null,null,null,null,null,null,null,{"$f":"'SP64'!C31","v":29},{"$f":"'SP64'!D31","v":"Spieler 8"},{"$f":"'SP64'!F31","v":0},null,null,null,null,null,{"$f":"'SP64'!E114","v":"Sieger 96"},{"$f":"'SP64'!G114","v":0},null,null,{"$f":"'SP64'!E129","v":"Verlierer 126"},{"$f":"'SP64'!G129","v":0}]
[null,null,"Pl. 3",null,null,null,null,{"$f":"'SP64'!C118","v":116},{"$f":"'SP64'!D118","v":"Sieger 108"},{"$f":"'SP64'!F118","v":0},{"$f":"'SP64'!E110","v":"Sieger 104"},{"$f":"'SP64'!G110","v":0},null,null,null,null,null,{"$f":"'SP64'!C49","v":47},{"$f":"'SP64'!D49","v":"Verlierer 29"},{"$f":"'SP64'!F49","v":0},null,{"$f":"'SP64'!E31","v":"Spieler 40"},{"$f":"'SP64'!G31","v":0},{"$f":"'SP64'!C65","v":63},{"$f":"'SP64'!D65","v":"Sieger 29"},{"$f":"'SP64'!F65","v":0},null,null,"Verlierer nach 114"]
[null,null,null,null,null,null,null,null,{"$f":"'SP64'!E118","v":"Verlierer 110"},{"$f":"'SP64'!G118","v":0},null,null,null,null,null,{"$f":"'SP64'!C81","v":79},{"$f":"'SP64'!D81","v":"Sieger 47"},{"$f":"'SP64'!F81","v":0},{"$f":"'SP64'!E49","v":"Verlierer 30"},{"$f":"'SP64'!G49","v":0},{"$f":"'SP64'!C32","v":30},{"$f":"'SP64'!D32","v":"Spieler 24"},{"$f":"'SP64'!F32","v":0},null,{"$f":"'SP64'!E65","v":"Sieger 30"},{"$f":"'SP64'!G65","v":0},null,null,null,null,null,"Sieger aus 125 muß 2 x gewinnen"]
[null,null,null,null,null,null,null,null,null,null,null,null,null,{"$f":"'SP64'!C90","v":88},{"$f":"'SP64'!D90","v":"Sieger 79"},{"$f":"'SP64'!F90","v":0},{"$f":"'SP64'!E81","v":"Verlierer 50"},{"$f":"'SP64'!G81","v":0},null,null,null,{"$f":"'SP64'!E32","v":"Spieler 56"},{"$f":"'SP64'!G32","v":0},null,"V. nach 66",{"$f":"'SP64'!C98","v":96},{"$f":"'SP64'!D98","v":"Sieger 63"},{"$f":"'SP64'!F98","v":0}]
[null,null,null,null,null,null,null,null,null,null,null,{"$f":"'SP64'!C106","v":104},{"$f":"'SP64'!D106","v":"Sieger 88"},{"$f":"'SP64'!F106","v":0},{"$f":"'SP64'!E90","v":"Sieger 80"},{"$f":"'SP64'!G90","v":0},null,null,null,null,{"$f":"'SP64'!C33","v":31},{"$f":"'SP64'!D33","v":"Spieler 16"},{"$f":"'SP64'!F33","v":0},null,null,null,{"$f":"'SP64'!E98","v":"Sieger 64"},{"$f":"'SP64'!G98","v":0}]
[null,null,null,null,null,null,null,null,null,null,null,null,{"$f":"'SP64'!E106","v":"Verlierer 93"},{"$f":"'SP64'!G106","v":0},null,null,null,{"$f":"'SP64'!C50","v":48},{"$f":"'SP64'!D50","v":"Verlierer 31"},{"$f":"'SP64'!F50","v":0},null,{"$f":"'SP64'!E33","v":"Spieler 48"},{"$f":"'SP64'!G33","v":0},{"$f":"'SP64'!C66","v":64},{"$f":"'SP64'!D66","v":"Sieger 31"},{"$f":"'SP64'!F66","v":0},"Verlierer nach 101"]
[null,null,null,null,null,null,null,null,null,null,null,null,null,null,null,{"$f":"'SP64'!C82","v":80},{"$f":"'SP64'!D82","v":"Sieger 48"},{"$f":"'SP64'!F82","v":0},{"$f":"'SP64'!E50","v":"Verlierer 32"},{"$f":"'SP64'!G50","v":0},{"$f":"'SP64'!C34","v":32},{"$f":"'SP64'!D34","v":"Spieler 32"},{"$f":"'SP64'!F34","v":0},null,{"$f":"'SP64'!E66","v":"Sieger 32"},{"$f":"'SP64'!G66","v":0}]
[null,null,null,null,null,null,null,null,null,null,null,null,null,null,null,null,{"$f":"'SP64'!E82","v":"Verlierer 49"},{"$f":"'SP64'!G82","v":0},null,null,null,{"$f":"'SP64'!E34","v":"Spieler 64"},{"$f":"'SP64'!G34","v":0},null,"V. nach 65"]

{"sheet":"Paarung drucken","index":5,"n_rows":13,"n_cols":8,"rows_kept":13,"cut":false,"hidden":false,"merged":[[1,1,1,7],[8,1,8,3],[8,5,8,7],[9,1,9,3],[2,1,2,7],[3,1,3,7],[6,1,6,2],[6,5,6,6],[13,0,13,8],[9,5,9,7],[10,1,10,3],[10,5,10,7],[12,0,12,8]]}
[]
[null,{"$f":"IF(Auslosung_Turnierdaten!G76=\"\",\"\",Auslosung_Turnierdaten!G76)","v":""}]
[null,{"$f":"IF(Auslosung_Turnierdaten!G78=\"\",\"\",Auslosung_Turnierdaten!G78)","v":""}]
[null,{"$f":"IF(Auslosung_Turnierdaten!G77=\"\",\"\",Auslosung_Turnierdaten!G77)","v":""}]
[]
[]
[null,"Spiel-Nr:",null,126,null,"Tisch:",null,{"$f":"VLOOKUP($D$7,_SP64,10,0)","v":0}]
[]
[null,{"$f":"VLOOKUP($D$7,_SP64,2,0)","v":"Sieger 124"},null,null,":",{"$f":"VLOOKUP($D$7,_SP64,3,0)","v":"Sieger 125"}]
[null,"Spieler 1",null,null,null,"Spieler 2"]
[null,"______",null,null,":","______"]
[]
["Ergebnis bitte eintragen und bei der Turnierleitung abgeben"]

{"sheet":"Tabelle","index":6,"n_rows":68,"n_cols":15,"rows_kept":68,"cut":false,"hidden":false,"merged":[]}
[null,null,null,{"$f":"IF(Auslosung_Turnierdaten!G76=\"\",\"\",Auslosung_Turnierdaten!G76) & IF(Auslosung_Turnierdaten!G77=\"\",\"\",\" - \" & Auslosung_Turnierdaten!G77)","v":""}]
[null,null,"PZ",{"$f":"'SP64'!W67","v":"Name, Vorname"},{"$f":"'SP64'!X67","v":"Verein"},{"$f":"'SP64'!Y67","v":"Verein_Nr"},{"$f":"'SP64'!Z67","v":"Lfd_Nr"},{"$f":"'SP64'!AA67","v":"Punkte"},{"$f":"'SP64'!AB67","v":"GP"},{"$f":"'SP64'!AC67","v":"VP"},{"$f":"'SP64'!AD67","v":"GSp"},{"$f":"'SP64'!AE67","v":"VSp"},{"$f":"'SP64'!AF67","v":"Quot"},{"$f":"'SP64'!AG67","v":""},{"$f":"'SP64'!AH67","v":""}]
[null,null,1,"Vor1 Nach2","Verein1",0,111,0,0,0,0,0,0,"",""]
[null,null,2,"Vor2 Nach3","Verein2",0,112,0,0,0,0,0,0,"",""]
[null,null,3,"Vor3 Nach4","Verein3",0,113,0,0,0,0,0,0,"",""]
[null,null,4,"Vor4 Nach5","Verein4",0,114,0,0,0,0,0,0,"",""]
[null,null,5,"Vor5 Nach6","Verein5",0,115,0,0,0,0,0,0,"",""]
[null,null,6,"Vor6 Nach7","Verein6",0,116,0,0,0,0,0,0,"",""]
[null,null,7,"Vor7 Nach8","Verein7",0,117,0,0,0,0,0,0,"",""]
[null,null,8,"Vor8 Nach9","Verein8",0,118,0,0,0,0,0,0,"",""]
[null,null,9,"Vor9 Nach10","Verein9",0,119,0,0,0,0,0,0,"",""]
[null,null,10,"Vor10 Nach11","Verein10",0,120,0,0,0,0,0,0,"",""]
[null,null,11,"Vor11 Nach12","Verein11",0,121,0,0,0,0,0,0,"",""]
[null,null,12,"Vor12 Nach13","Verein12",0,122,0,0,0,0,0,0,"",""]
[null,null,13,"Vor13 Nach14","Verein13",0,123,0,0,0,0,0,0,"",""]
[null,null,14,"Vor14 Nach15","Verein14",0,124,0,0,0,0,0,0,"",""]
[null,null,15,"Vor15 Nach16","Verein15",0,125,0,0,0,0,0,0,"",""]
[null,null,16,"Vor16 Nach17","Verein16",0,126,0,0,0,0,0,0,"",""]
[null,null,17,"Vor17 Nach18","Verein17",0,127,0,0,0,0,0,0,"",""]
[null,null,18,"Vor18 Nach19","Verein18",0,128,0,0,0,0,0,0,"",""]
[null,null,19,"Vor19 Nach20","Verein19",0,129,0,0,0,0,0,0,"",""]
[null,null,20,"Vor20 Nach21","Verein20",0,130,0,0,0,0,0,0,"",""]
[null,null,21,"Vor21 Nach22","Verein21",0,131,0,0,0,0,0,0,"",""]
[null,null,22,"Vor22 Nach23","Verein22",0,132,0,0,0,0,0,0,"",""]
[null,null,23,"Vor23 Nach24","Verein23",0,133,0,0,0,0,0,0,"",""]
[null,null,24,"Vor24 Nach25","Verein24",0,134,0,0,0,0,0,0,"",""]
[null,null,25,"Vor25 Nach26","Verein25",0,135,0,0,0,0,0,0,"",""]
[null,null,26,"Vor26 Nach27","Verein26",0,136,0,0,0,0,0,0,"",""]
[null,null,27,"Vor27 Nach28","Verein27",0,137,0,0,0,0,0,0,"",""]
[null,null,28,"Vor28 Nach29","Verein28",0,138,0,0,0,0,0,0,"",""]
[null,null,29,"Vor29 Nach30","Verein29",0,139,0,0,0,0,0,0,"",""]
[null,null,30,"Vor30 Nach31","Verein30",0,140,0,0,0,0,0,0,"",""]
[null,null,31,"Vor31 Nach32","Verein31",0,141,0,0,0,0,0,0,"",""]
[null,null,32,"Vor32 Nach33","Verein32",0,142,0,0,0,0,0,0,"",""]
[null,{"$f":"IF(Auslosung_Turnierdaten!F41=\"\",\"\",33)","v":""},33,"Vor33 Nach34","Verein33",0,143,0,0,0,0,0,0,"",""]
[null,{"$f":"IF(Auslosung_Turnierdaten!F42=\"\",\"\",34)","v":""},34,"Vor34 Nach35","Verein34",0,144,0,0,0,0,0,0,"",""]
[null,null,35,"Vor35 Nach36","Verein35",0,145,0,0,0,0,0,0,"",""]
[null,null,36,"Vor36 Nach37","Verein36",0,146,0,0,0,0,0,0,"",""]
[null,null,37,"Vor37 Nach38","Verein37",0,147,0,0,0,0,0,0,"",""]
[null,null,38,"Vor38 Nach39","Verein38",0,148,0,0,0,0,0,0,"",""]
[null,{"$f":"IF(Auslosung_Turnierdaten!F47=\"\",\"\",39)","v":""},39,"Vor39 Nach40","Verein39",0,149,0,0,0,0,0,0,"",""]
[null,{"$f":"IF(Auslosung_Turnierdaten!F48=\"\",\"\",40)","v":""},40,"Vor40 Nach41","Verein40",0,150,0,0,0,0,0,0,"",""]
[null,{"$f":"IF(Auslosung_Turnierdaten!F49=\"\",\"\",41)","v":""},41,"Vor41 Nach42","Verein41",0,151,0,0,0,0,0,0,"",""]
[null,{"$f":"IF(Auslosung_Turnierdaten!F50=\"\",\"\",42)","v":""},42,"Vor42 Nach43","Verein42",0,152,0,0,0,0,0,0,"",""]
[null,{"$f":"IF(Auslosung_Turnierdaten!F51=\"\",\"\",43)","v":""},43,"Vor43 Nach44","Verein43",0,153,0,0,0,0,0,0,"",""]
[null,{"$f":"IF(Auslosung_Turnierdaten!F52=\"\",\"\",44)","v":""},44,"Vor44 Nach45","Verein44",0,154,0,0,0,0,0,0,"",""]
[null,{"$f":"IF(Auslosung_Turnierdaten!F53=\"\",\"\",45)","v":""},45,"Vor45 Nach46","Verein45",0,155,0,0,0,0,0,0,"",""]
[null,{"$f":"IF(Auslosung_Turnierdaten!F54=\"\",\"\",46)","v":""},46,"Vor46 Nach47","Verein46",0,156,0,0,0,0,0,0,"",""]
[null,{"$f":"IF(Auslosung_Turnierdaten!F55=\"\",\"\",47)","v":""},47,"Vor47 Nach48","Verein47",0,157,0,0,0,0,0,0,"",""]
[null,{"$f":"IF(Auslosung_Turnierdaten!F56=\"\",\"\",48)","v":""},48,"Vor48 Nach49","Verein48",0,158,0,0,0,0,0,0,"",""]
[null,{"$f":"IF(Auslosung_Turnierdaten!F57=\"\",\"\",49)","v":""},49,"Vor49 Nach50","Verein49",0,159,0,0,0,0,0,0,"",""]
[null,{"$f":"IF(Auslosung_Turnierdaten!F58=\"\",\"\",50)","v":""},50,"Vor50 Nach51","Verein50",0,160,0,0,0,0,0,0,"",""]
[null,{"$f":"IF(Auslosung_Turnierdaten!F59=\"\",\"\",51)","v":""},51,"Vor51 Nach52","Verein51",0,161,0,0,0,0,0,0,"",""]
[null,{"$f":"IF(Auslosung_Turnierdaten!F60=\"\",\"\",52)","v":""},52,"Vor52 Nach53","Verein52",0,162,0,0,0,0,0,0,"",""]
[null,{"$f":"IF(Auslosung_Turnierdaten!F61=\"\",\"\",53)","v":""},53,"Vor53 Nach54","Verein53",0,163,0,0,0,0,0,0,"",""]
[null,{"$f":"IF(Auslosung_Turnierdaten!F62=\"\",\"\",54)","v":""},54,"Vor54 Nach55","Verein54",0,164,0,0,0,0,0,0,"",""]
[null,{"$f":"IF(Auslosung_Turnierdaten!F63=\"\",\"\",55)","v":""},55,"Vor55 Nach56","Verein55",0,165,0,0,0,0,0,0,"",""]
[null,{"$f":"IF(Auslosung_Turnierdaten!F64=\"\",\"\",56)","v":""},56,"Vor56 Nach57","Verein56",0,166,0,0,0,0,0,0,"",""]
[null,{"$f":"IF(Auslosung_Turnierdaten!F65=\"\",\"\",57)","v":""},57,"Vor57 Nach58","Verein57",0,167,0,0,0,0,0,0,"",""]
[null,{"$f":"IF(Auslosung_Turnierdaten!F66=\"\",\"\",58)","v":""},58,"Vor58 Nach59","Verein58",0,168,0,0,0,0,0,0,"",""]
[null,{"$f":"IF(Auslosung_Turnierdaten!F67=\"\",\"\",59)","v":""},59,"Vor59 Nach60","Verein59",0,169,0,0,0,0,0,0,"",""]
[null,{"$f":"IF(Auslosung_Turnierdaten!F68=\"\",\"\",60)","v":""},60,"Vor60 Nach61","Verein60",0,170,0,0,0,0,0,0,"",""]
[null,{"$f":"IF(Auslosung_Turnierdaten!F69=\"\",\"\",61)","v":""},61,"Vor61 Nach62","Verein61",0,171,0,0,0,0,0,0,"",""]
[null,{"$f":"IF(Auslosung_Turnierdaten!F70=\"\",\"\",62)","v":""},62,"Vor62 Nach63","Verein62",0,172,0,0,0,0,0,0,"",""]
[null,{"$f":"IF(Auslosung_Turnierdaten!F71=\"\",\"\",63)","v":""},63,"Vor63 Nach64","Verein63",0,173,0,0,0,0,0,0,"",""]
[null,{"$f":"IF(Auslosung_Turnierdaten!F72=\"\",\"\",64)","v":""},64,"Vor64 Nach65","Verein64",0,174,0,0,0,0,0,0,"",""]
[null,null,null,"Turnierleitung:",{"$f":"IF(Auslosung_Turnierdaten!G80=\"\",\"\",Auslosung_Turnierdaten!G80)","v":""}]
[null,null,null,"Termin:",{"$f":"IF(Auslosung_Turnierdaten!G78=\"\",\"\",Auslosung_Turnierdaten!G78)","v":""}]

{"sheet":"BA-Export","index":7,"n_rows":124,"n_cols":13,"rows_kept":124,"cut":false,"hidden":false,"merged":[]}
[{"$f":"'SP64'!B3","v":"HR"},{"$f":"'SP64'!C3","v":1},{"$f":"IF(('SP64'!D3)=\"Freilos\",0,VLOOKUP('SP64'!D3,'BA-Teilnehmer'!$G$6:$J$69,4,FALSE))","v":{"$error":"#N/A"}},{"$f":"IF(('SP64'!E3)=\"Freilos\",0,VLOOKUP('SP64'!E3,'BA-Teilnehmer'!$G$6:$J$69,4,FALSE))","v":{"$error":"#N/A"}},{"$f":"'SP64'!F3","v":0},{"$f":"'SP64'!G3","v":0},{"$f":"'SP64'!H3","v":0},{"$f":"'SP64'!I3","v":0},{"$f":"'SP64'!J3","v":0},{"$f":"'SP64'!K3","v":0},{"$f":"'SP64'!L3","v":0},{"$f":"'SP64'!AS3","v":"00:00:00"},{"$f":"'SP64'!AT3","v":"00:00:00"}]
[{"$f":"A1","v":"HR"},{"$f":"'SP64'!C4","v":2},{"$f":"IF(('SP64'!D4)=\"Freilos\",0,VLOOKUP('SP64'!D4,'BA-Teilnehmer'!$G$6:$J$69,4,FALSE))","v":{"$error":"#N/A"}},{"$f":"IF(('SP64'!E4)=\"Freilos\",0,VLOOKUP('SP64'!E4,'BA-Teilnehmer'!$G$6:$J$69,4,FALSE))","v":{"$error":"#N/A"}},{"$f":"'SP64'!F4","v":0},{"$f":"'SP64'!G4","v":0},{"$f":"'SP64'!H4","v":0},{"$f":"'SP64'!I4","v":0},{"$f":"'SP64'!J4","v":0},{"$f":"'SP64'!K4","v":0},{"$f":"'SP64'!L4","v":0},{"$f":"'SP64'!AS4","v":"00:00:00"},{"$f":"'SP64'!AT4","v":"00:00:00"}]
[{"$f":"A2","v":"HR"},{"$f":"'SP64'!C5","v":3},{"$f":"IF(('SP64'!D5)=\"Freilos\",0,VLOOKUP('SP64'!D5,'BA-Teilnehmer'!$G$6:$J$69,4,FALSE))","v":{"$error":"#N/A"}},{"$f":"IF(('SP64'!E5)=\"Freilos\",0,VLOOKUP('SP64'!E5,'BA-Teilnehmer'!$G$6:$J$69,4,FALSE))","v":{"$error":"#N/A"}},{"$f":"'SP64'!F5","v":0},{"$f":"'SP64'!G5","v":0},{"$f":"'SP64'!H5","v":0},{"$f":"'SP64'!I5","v":0},{"$f":"'SP64'!J5","v":0},{"$f":"'SP64'!K5","v":0},{"$f":"'SP64'!L5","v":0},{"$f":"'SP64'!AS5","v":"00:00:00"},{"$f":"'SP64'!AT5","v":"00:00:00"}]
["HR",{"$f":"'SP64'!C6","v":4},{"$f":"IF(('SP64'!D6)=\"Freilos\",0,VLOOKUP('SP64'!D6,'BA-Teilnehmer'!$G$6:$J$69,4,FALSE))","v":{"$error":"#N/A"}},{"$f":"IF(('SP64'!E6)=\"Freilos\",0,VLOOKUP('SP64'!E6,'BA-Teilnehmer'!$G$6:$J$69,4,FALSE))","v":{"$error":"#N/A"}},{"$f":"'SP64'!F6","v":0},{"$f":"'SP64'!G6","v":0},{"$f":"'SP64'!H6","v":0},{"$f":"'SP64'!I6","v":0},{"$f":"'SP64'!J6","v":0},{"$f":"'SP64'!K6","v":0},{"$f":"'SP64'!L6","v":0},{"$f":"'SP64'!AS6","v":"00:00:00"},{"$f":"'SP64'!AT6","v":"00:00:00"}]
["HR",{"$f":"'SP64'!C7","v":5},{"$f":"IF(('SP64'!D7)=\"Freilos\",0,VLOOKUP('SP64'!D7,'BA-Teilnehmer'!$G$6:$J$69,4,FALSE))","v":{"$error":"#N/A"}},{"$f":"IF(('SP64'!E7)=\"Freilos\",0,VLOOKUP('SP64'!E7,'BA-Teilnehmer'!$G$6:$J$69,4,FALSE))","v":{"$error":"#N/A"}},{"$f":"'SP64'!F7","v":0},{"$f":"'SP64'!G7","v":0},{"$f":"'SP64'!H7","v":0},{"$f":"'SP64'!I7","v":0},{"$f":"'SP64'!J7","v":0},{"$f":"'SP64'!K7","v":0},{"$f":"'SP64'!L7","v":0},{"$f":"'SP64'!AS7","v":"00:00:00"},{"$f":"'SP64'!AT7","v":"00:00:00"}]
["HR",{"$f":"'SP64'!C8","v":6},{"$f":"IF(('SP64'!D8)=\"Freilos\",0,VLOOKUP('SP64'!D8,'BA-Teilnehmer'!$G$6:$J$69,4,FALSE))","v":{"$error":"#N/A"}},{"$f":"IF(('SP64'!E8)=\"Freilos\",0,VLOOKUP('SP64'!E8,'BA-Teilnehmer'!$G$6:$J$69,4,FALSE))","v":{"$error":"#N/A"}},{"$f":"'SP64'!F8","v":0},{"$f":"'SP64'!G8","v":0},{"$f":"'SP64'!H8","v":0},{"$f":"'SP64'!I8","v":0},{"$f":"'SP64'!J8","v":0},{"$f":"'SP64'!K8","v":0},{"$f":"'SP64'!L8","v":0},{"$f":"'SP64'!AS8","v":"00:00:00"},{"$f":"'SP64'!AT8","v":"00:00:00"}]
["HR",{"$f":"'SP64'!C9","v":7},{"$f":"IF(('SP64'!D9)=\"Freilos\",0,VLOOKUP('SP64'!D9,'BA-Teilnehmer'!$G$6:$J$69,4,FALSE))","v":{"$error":"#N/A"}},{"$f":"IF(('SP64'!E9)=\"Freilos\",0,VLOOKUP('SP64'!E9,'BA-Teilnehmer'!$G$6:$J$69,4,FALSE))","v":{"$error":"#N/A"}},{"$f":"'SP64'!F9","v":0},{"$f":"'SP64'!G9","v":0},{"$f":"'SP64'!H9","v":0},{"$f":"'SP64'!I9","v":0},{"$f":"'SP64'!J9","v":0},{"$f":"'SP64'!K9","v":0},{"$f":"'SP64'!L9","v":0},{"$f":"'SP64'!AS9","v":"00:00:00"},{"$f":"'SP64'!AT9","v":"00:00:00"}]
["HR",{"$f":"'SP64'!C10","v":8},{"$f":"IF(('SP64'!D10)=\"Freilos\",0,VLOOKUP('SP64'!D10,'BA-Teilnehmer'!$G$6:$J$69,4,FALSE))","v":{"$error":"#N/A"}},{"$f":"IF(('SP64'!E10)=\"Freilos\",0,VLOOKUP('SP64'!E10,'BA-Teilnehmer'!$G$6:$J$69,4,FALSE))","v":{"$error":"#N/A"}},{"$f":"'SP64'!F10","v":0},{"$f":"'SP64'!G10","v":0},{"$f":"'SP64'!H10","v":0},{"$f":"'SP64'!I10","v":0},{"$f":"'SP64'!J10","v":0},{"$f":"'SP64'!K10","v":0},{"$f":"'SP64'!L10","v":0},{"$f":"'SP64'!AS10","v":"00:00:00"},{"$f":"'SP64'!AT10","v":"00:00:00"}]
["HR",{"$f":"'SP64'!C11","v":9},{"$f":"IF(('SP64'!D11)=\"Freilos\",0,VLOOKUP('SP64'!D11,'BA-Teilnehmer'!$G$6:$J$69,4,FALSE))","v":{"$error":"#N/A"}},{"$f":"IF(('SP64'!E11)=\"Freilos\",0,VLOOKUP('SP64'!E11,'BA-Teilnehmer'!$G$6:$J$69,4,FALSE))","v":{"$error":"#N/A"}},{"$f":"'SP64'!F11","v":0},{"$f":"'SP64'!G11","v":0},{"$f":"'SP64'!H11","v":0},{"$f":"'SP64'!I11","v":0},{"$f":"'SP64'!J11","v":0},{"$f":"'SP64'!K11","v":0},{"$f":"'SP64'!L11","v":0},{"$f":"'SP64'!AS11","v":"00:00:00"},{"$f":"'SP64'!AT11","v":"00:00:00"}]
["HR",{"$f":"'SP64'!C12","v":10},{"$f":"IF(('SP64'!D12)=\"Freilos\",0,VLOOKUP('SP64'!D12,'BA-Teilnehmer'!$G$6:$J$69,4,FALSE))","v":{"$error":"#N/A"}},{"$f":"IF(('SP64'!E12)=\"Freilos\",0,VLOOKUP('SP64'!E12,'BA-Teilnehmer'!$G$6:$J$69,4,FALSE))","v":{"$error":"#N/A"}},{"$f":"'SP64'!F12","v":0},{"$f":"'SP64'!G12","v":0},{"$f":"'SP64'!H12","v":0},{"$f":"'SP64'!I12","v":0},{"$f":"'SP64'!J12","v":0},{"$f":"'SP64'!K12","v":0},{"$f":"'SP64'!L12","v":0},{"$f":"'SP64'!AS12","v":"00:00:00"},{"$f":"'SP64'!AT12","v":"00:00:00"}]
["HR",{"$f":"'SP64'!C13","v":11},{"$f":"IF(('SP64'!D13)=\"Freilos\",0,VLOOKUP('SP64'!D13,'BA-Teilnehmer'!$G$6:$J$69,4,FALSE))","v":{"$error":"#N/A"}},{"$f":"IF(('SP64'!E13)=\"Freilos\",0,VLOOKUP('SP64'!E13,'BA-Teilnehmer'!$G$6:$J$69,4,FALSE))","v":{"$error":"#N/A"}},{"$f":"'SP64'!F13","v":0},{"$f":"'SP64'!G13","v":0},{"$f":"'SP64'!H13","v":0},{"$f":"'SP64'!I13","v":0},{"$f":"'SP64'!J13","v":0},{"$f":"'SP64'!K13","v":0},{"$f":"'SP64'!L13","v":0},{"$f":"'SP64'!AS13","v":"00:00:00"},{"$f":"'SP64'!AT13","v":"00:00:00"}]
["HR",{"$f":"'SP64'!C14","v":12},{"$f":"IF(('SP64'!D14)=\"Freilos\",0,VLOOKUP('SP64'!D14,'BA-Teilnehmer'!$G$6:$J$69,4,FALSE))","v":{"$error":"#N/A"}},{"$f":"IF(('SP64'!E14)=\"Freilos\",0,VLOOKUP('SP64'!E14,'BA-Teilnehmer'!$G$6:$J$69,4,FALSE))","v":{"$error":"#N/A"}},{"$f":"'SP64'!F14","v":0},{"$f":"'SP64'!G14","v":0},{"$f":"'SP64'!H14","v":0},{"$f":"'SP64'!I14","v":0},{"$f":"'SP64'!J14","v":0},{"$f":"'SP64'!K14","v":0},{"$f":"'SP64'!L14","v":0},{"$f":"'SP64'!AS14","v":"00:00:00"},{"$f":"'SP64'!AT14","v":"00:00:00"}]
["HR",{"$f":"'SP64'!C15","v":13},{"$f":"IF(('SP64'!D15)=\"Freilos\",0,VLOOKUP('SP64'!D15,'BA-Teilnehmer'!$G$6:$J$69,4,FALSE))","v":{"$error":"#N/A"}},{"$f":"IF(('SP64'!E15)=\"Freilos\",0,VLOOKUP('SP64'!E15,'BA-Teilnehmer'!$G$6:$J$69,4,FALSE))","v":{"$error":"#N/A"}},{"$f":"'SP64'!F15","v":0},{"$f":"'SP64'!G15","v":0},{"$f":"'SP64'!H15","v":0},{"$f":"'SP64'!I15","v":0},{"$f":"'SP64'!J15","v":0},{"$f":"'SP64'!K15","v":0},{"$f":"'SP64'!L15","v":0},{"$f":"'SP64'!AS15","v":"00:00:00"},{"$f":"'SP64'!AT15","v":"00:00:00"}]
["HR",{"$f":"'SP64'!C16","v":14},{"$f":"IF(('SP64'!D16)=\"Freilos\",0,VLOOKUP('SP64'!D16,'BA-Teilnehmer'!$G$6:$J$69,4,FALSE))","v":{"$error":"#N/A"}},{"$f":"IF(('SP64'!E16)=\"Freilos\",0,VLOOKUP('SP64'!E16,'BA-Teilnehmer'!$G$6:$J$69,4,FALSE))","v":{"$error":"#N/A"}},{"$f":"'SP64'!F16","v":0},{"$f":"'SP64'!G16","v":0},{"$f":"'SP64'!H16","v":0},{"$f":"'SP64'!I16","v":0},{"$f":"'SP64'!J16","v":0},{"$f":"'SP64'!K16","v":0},{"$f":"'SP64'!L16","v":0},{"$f":"'SP64'!AS16","v":"00:00:00"},{"$f":"'SP64'!AT16","v":"00:00:00"}]
["HR",{"$f":"'SP64'!C17","v":15},{"$f":"IF(('SP64'!D17)=\"Freilos\",0,VLOOKUP('SP64'!D17,'BA-Teilnehmer'!$G$6:$J$69,4,FALSE))","v":{"$error":"#N/A"}},{"$f":"IF(('SP64'!E17)=\"Freilos\",0,VLOOKUP('SP64'!E17,'BA-Teilnehmer'!$G$6:$J$69,4,FALSE))","v":{"$error":"#N/A"}},{"$f":"'SP64'!F17","v":0},{"$f":"'SP64'!G17","v":0},{"$f":"'SP64'!H17","v":0},{"$f":"'SP64'!I17","v":0},{"$f":"'SP64'!J17","v":0},{"$f":"'SP64'!K17","v":0},{"$f":"'SP64'!L17","v":0},{"$f":"'SP64'!AS17","v":"00:00:00"},{"$f":"'SP64'!AT17","v":"00:00:00"}]
["HR",{"$f":"'SP64'!C18","v":16},{"$f":"IF(('SP64'!D18)=\"Freilos\",0,VLOOKUP('SP64'!D18,'BA-Teilnehmer'!$G$6:$J$69,4,FALSE))","v":{"$error":"#N/A"}},{"$f":"IF(('SP64'!E18)=\"Freilos\",0,VLOOKUP('SP64'!E18,'BA-Teilnehmer'!$G$6:$J$69,4,FALSE))","v":{"$error":"#N/A"}},{"$f":"'SP64'!F18","v":0},{"$f":"'SP64'!G18","v":0},{"$f":"'SP64'!H18","v":0},{"$f":"'SP64'!I18","v":0},{"$f":"'SP64'!J18","v":0},{"$f":"'SP64'!K18","v":0},{"$f":"'SP64'!L18","v":0},{"$f":"'SP64'!AS18","v":"00:00:00"},{"$f":"'SP64'!AT18","v":"00:00:00"}]
["HR",{"$f":"'SP64'!C19","v":17},{"$f":"IF(('SP64'!D19)=\"Freilos\",0,VLOOKUP('SP64'!D19,'BA-Teilnehmer'!$G$6:$J$69,4,FALSE))","v":{"$error":"#N/A"}},{"$f":"IF(('SP64'!E19)=\"Freilos\",0,VLOOKUP('SP64'!E19,'BA-Teilnehmer'!$G$6:$J$69,4,FALSE))","v":{"$error":"#N/A"}},{"$f":"'SP64'!F19","v":0},{"$f":"'SP64'!G19","v":0},{"$f":"'SP64'!H19","v":0},{"$f":"'SP64'!I19","v":0},{"$f":"'SP64'!J19","v":0},{"$f":"'SP64'!K19","v":0},{"$f":"'SP64'!L19","v":0},{"$f":"'SP64'!AS19","v":"00:00:00"},{"$f":"'SP64'!AT19","v":"00:00:00"}]
["HR",{"$f":"'SP64'!C20","v":18},{"$f":"IF(('SP64'!D20)=\"Freilos\",0,VLOOKUP('SP64'!D20,'BA-Teilnehmer'!$G$6:$J$69,4,FALSE))","v":{"$error":"#N/A"}},{"$f":"IF(('SP64'!E20)=\"Freilos\",0,VLOOKUP('SP64'!E20,'BA-Teilnehmer'!$G$6:$J$69,4,FALSE))","v":{"$error":"#N/A"}},{"$f":"'SP64'!F20","v":0},{"$f":"'SP64'!G20","v":0},{"$f":"'SP64'!H20","v":0},{"$f":"'SP64'!I20","v":0},{"$f":"'SP64'!J20","v":0},{"$f":"'SP64'!K20","v":0},{"$f":"'SP64'!L20","v":0},{"$f":"'SP64'!AS20","v":"00:00:00"},{"$f":"'SP64'!AT20","v":"00:00:00"}]
["HR",{"$f":"'SP64'!C21","v":19},{"$f":"IF(('SP64'!D21)=\"Freilos\",0,VLOOKUP('SP64'!D21,'BA-Teilnehmer'!$G$6:$J$69,4,FALSE))","v":{"$error":"#N/A"}},{"$f":"IF(('SP64'!E21)=\"Freilos\",0,VLOOKUP('SP64'!E21,'BA-Teilnehmer'!$G$6:$J$69,4,FALSE))","v":{"$error":"#N/A"}},{"$f":"'SP64'!F21","v":0},{"$f":"'SP64'!G21","v":0},{"$f":"'SP64'!H21","v":0},{"$f":"'SP64'!I21","v":0},{"$f":"'SP64'!J21","v":0},{"$f":"'SP64'!K21","v":0},{"$f":"'SP64'!L21","v":0},{"$f":"'SP64'!AS21","v":"00:00:00"},{"$f":"'SP64'!AT21","v":"00:00:00"}]
["HR",{"$f":"'SP64'!C22","v":20},{"$f":"IF(('SP64'!D22)=\"Freilos\",0,VLOOKUP('SP64'!D22,'BA-Teilnehmer'!$G$6:$J$69,4,FALSE))","v":{"$error":"#N/A"}},{"$f":"IF(('SP64'!E22)=\"Freilos\",0,VLOOKUP('SP64'!E22,'BA-Teilnehmer'!$G$6:$J$69,4,FALSE))","v":{"$error":"#N/A"}},{"$f":"'SP64'!F22","v":0},{"$f":"'SP64'!G22","v":0},{"$f":"'SP64'!H22","v":0},{"$f":"'SP64'!I22","v":0},{"$f":"'SP64'!J22","v":0},{"$f":"'SP64'!K22","v":0},{"$f":"'SP64'!L22","v":0},{"$f":"'SP64'!AS22","v":"00:00:00"},{"$f":"'SP64'!AT22","v":"00:00:00"}]
["HR",{"$f":"'SP64'!C23","v":21},{"$f":"IF(('SP64'!D23)=\"Freilos\",0,VLOOKUP('SP64'!D23,'BA-Teilnehmer'!$G$6:$J$69,4,FALSE))","v":{"$error":"#N/A"}},{"$f":"IF(('SP64'!E23)=\"Freilos\",0,VLOOKUP('SP64'!E23,'BA-Teilnehmer'!$G$6:$J$69,4,FALSE))","v":{"$error":"#N/A"}},{"$f":"'SP64'!F23","v":0},{"$f":"'SP64'!G23","v":0},{"$f":"'SP64'!H23","v":0},{"$f":"'SP64'!I23","v":0},{"$f":"'SP64'!J23","v":0},{"$f":"'SP64'!K23","v":0},{"$f":"'SP64'!L23","v":0},{"$f":"'SP64'!AS23","v":"00:00:00"},{"$f":"'SP64'!AT23","v":"00:00:00"}]
["HR",{"$f":"'SP64'!C24","v":22},{"$f":"IF(('SP64'!D24)=\"Freilos\",0,VLOOKUP('SP64'!D24,'BA-Teilnehmer'!$G$6:$J$69,4,FALSE))","v":{"$error":"#N/A"}},{"$f":"IF(('SP64'!E24)=\"Freilos\",0,VLOOKUP('SP64'!E24,'BA-Teilnehmer'!$G$6:$J$69,4,FALSE))","v":{"$error":"#N/A"}},{"$f":"'SP64'!F24","v":0},{"$f":"'SP64'!G24","v":0},{"$f":"'SP64'!H24","v":0},{"$f":"'SP64'!I24","v":0},{"$f":"'SP64'!J24","v":0},{"$f":"'SP64'!K24","v":0},{"$f":"'SP64'!L24","v":0},{"$f":"'SP64'!AS24","v":"00:00:00"},{"$f":"'SP64'!AT24","v":"00:00:00"}]
["HR",{"$f":"'SP64'!C25","v":23},{"$f":"IF(('SP64'!D25)=\"Freilos\",0,VLOOKUP('SP64'!D25,'BA-Teilnehmer'!$G$6:$J$69,4,FALSE))","v":{"$error":"#N/A"}},{"$f":"IF(('SP64'!E25)=\"Freilos\",0,VLOOKUP('SP64'!E25,'BA-Teilnehmer'!$G$6:$J$69,4,FALSE))","v":{"$error":"#N/A"}},{"$f":"'SP64'!F25","v":0},{"$f":"'SP64'!G25","v":0},{"$f":"'SP64'!H25","v":0},{"$f":"'SP64'!I25","v":0},{"$f":"'SP64'!J25","v":0},{"$f":"'SP64'!K25","v":0},{"$f":"'SP64'!L25","v":0},{"$f":"'SP64'!AS25","v":"00:00:00"},{"$f":"'SP64'!AT25","v":"00:00:00"}]
["HR",{"$f":"'SP64'!C26","v":24},{"$f":"IF(('SP64'!D26)=\"Freilos\",0,VLOOKUP('SP64'!D26,'BA-Teilnehmer'!$G$6:$J$69,4,FALSE))","v":{"$error":"#N/A"}},{"$f":"IF(('SP64'!E26)=\"Freilos\",0,VLOOKUP('SP64'!E26,'BA-Teilnehmer'!$G$6:$J$69,4,FALSE))","v":{"$error":"#N/A"}},{"$f":"'SP64'!F26","v":0},{"$f":"'SP64'!G26","v":0},{"$f":"'SP64'!H26","v":0},{"$f":"'SP64'!I26","v":0},{"$f":"'SP64'!J26","v":0},{"$f":"'SP64'!K26","v":0},{"$f":"'SP64'!L26","v":0},{"$f":"'SP64'!AS26","v":"00:00:00"},{"$f":"'SP64'!AT26","v":"00:00:00"}]
["HR",{"$f":"'SP64'!C27","v":25},{"$f":"IF(('SP64'!D27)=\"Freilos\",0,VLOOKUP('SP64'!D27,'BA-Teilnehmer'!$G$6:$J$69,4,FALSE))","v":{"$error":"#N/A"}},{"$f":"IF(('SP64'!E27)=\"Freilos\",0,VLOOKUP('SP64'!E27,'BA-Teilnehmer'!$G$6:$J$69,4,FALSE))","v":{"$error":"#N/A"}},{"$f":"'SP64'!F27","v":0},{"$f":"'SP64'!G27","v":0},{"$f":"'SP64'!H27","v":0},{"$f":"'SP64'!I27","v":0},{"$f":"'SP64'!J27","v":0},{"$f":"'SP64'!K27","v":0},{"$f":"'SP64'!L27","v":0},{"$f":"'SP64'!AS27","v":"00:00:00"},{"$f":"'SP64'!AT27","v":"00:00:00"}]
["HR",{"$f":"'SP64'!C28","v":26},{"$f":"IF(('SP64'!D28)=\"Freilos\",0,VLOOKUP('SP64'!D28,'BA-Teilnehmer'!$G$6:$J$69,4,FALSE))","v":{"$error":"#N/A"}},{"$f":"IF(('SP64'!E28)=\"Freilos\",0,VLOOKUP('SP64'!E28,'BA-Teilnehmer'!$G$6:$J$69,4,FALSE))","v":{"$error":"#N/A"}},{"$f":"'SP64'!F28","v":0},{"$f":"'SP64'!G28","v":0},{"$f":"'SP64'!H28","v":0},{"$f":"'SP64'!I28","v":0},{"$f":"'SP64'!J28","v":0},{"$f":"'SP64'!K28","v":0},{"$f":"'SP64'!L28","v":0},{"$f":"'SP64'!AS28","v":"00:00:00"},{"$f":"'SP64'!AT28","v":"00:00:00"}]
["HR",{"$f":"'SP64'!C29","v":27},{"$f":"IF(('SP64'!D29)=\"Freilos\",0,VLOOKUP('SP64'!D29,'BA-Teilnehmer'!$G$6:$J$69,4,FALSE))","v":{"$error":"#N/A"}},{"$f":"IF(('SP64'!E29)=\"Freilos\",0,VLOOKUP('SP64'!E29,'BA-Teilnehmer'!$G$6:$J$69,4,FALSE))","v":{"$error":"#N/A"}},{"$f":"'SP64'!F29","v":0},{"$f":"'SP64'!G29","v":0},{"$f":"'SP64'!H29","v":0},{"$f":"'SP64'!I29","v":0},{"$f":"'SP64'!J29","v":0},{"$f":"'SP64'!K29","v":0},{"$f":"'SP64'!L29","v":0},{"$f":"'SP64'!AS29","v":"00:00:00"},{"$f":"'SP64'!AT29","v":"00:00:00"}]
["HR",{"$f":"'SP64'!C30","v":28},{"$f":"IF(('SP64'!D30)=\"Freilos\",0,VLOOKUP('SP64'!D30,'BA-Teilnehmer'!$G$6:$J$69,4,FALSE))","v":{"$error":"#N/A"}},{"$f":"IF(('SP64'!E30)=\"Freilos\",0,VLOOKUP('SP64'!E30,'BA-Teilnehmer'!$G$6:$J$69,4,FALSE))","v":{"$error":"#N/A"}},{"$f":"'SP64'!F30","v":0},{"$f":"'SP64'!G30","v":0},{"$f":"'SP64'!H30","v":0},{"$f":"'SP64'!I30","v":0},{"$f":"'SP64'!J30","v":0},{"$f":"'SP64'!K30","v":0},{"$f":"'SP64'!L30","v":0},{"$f":"'SP64'!AS30","v":"00:00:00"},{"$f":"'SP64'!AT30","v":"00:00:00"}]
["HR",{"$f":"'SP64'!C31","v":29},{"$f":"IF(('SP64'!D31)=\"Freilos\",0,VLOOKUP('SP64'!D31,'BA-Teilnehmer'!$G$6:$J$69,4,FALSE))","v":{"$error":"#N/A"}},{"$f":"IF(('SP64'!E31)=\"Freilos\",0,VLOOKUP('SP64'!E31,'BA-Teilnehmer'!$G$6:$J$69,4,FALSE))","v":{"$error":"#N/A"}},{"$f":"'SP64'!F31","v":0},{"$f":"'SP64'!G31","v":0},{"$f":"'SP64'!H31","v":0},{"$f":"'SP64'!I31","v":0},{"$f":"'SP64'!J31","v":0},{"$f":"'SP64'!K31","v":0},{"$f":"'SP64'!L31","v":0},{"$f":"'SP64'!AS31","v":"00:00:00"},{"$f":"'SP64'!AT31","v":"00:00:00"}]
["HR",{"$f":"'SP64'!C32","v":30},{"$f":"IF(('SP64'!D32)=\"Freilos\",0,VLOOKUP('SP64'!D32,'BA-Teilnehmer'!$G$6:$J$69,4,FALSE))","v":{"$error":"#N/A"}},{"$f":"IF(('SP64'!E32)=\"Freilos\",0,VLOOKUP('SP64'!E32,'BA-Teilnehmer'!$G$6:$J$69,4,FALSE))","v":{"$error":"#N/A"}},{"$f":"'SP64'!F32","v":0},{"$f":"'SP64'!G32","v":0},{"$f":"'SP64'!H32","v":0},{"$f":"'SP64'!I32","v":0},{"$f":"'SP64'!J32","v":0},{"$f":"'SP64'!K32","v":0},{"$f":"'SP64'!L32","v":0},{"$f":"'SP64'!AS32","v":"00:00:00"},{"$f":"'SP64'!AT32","v":"00:00:00"}]
["HR",{"$f":"'SP64'!C33","v":31},{"$f":"IF(('SP64'!D33)=\"Freilos\",0,VLOOKUP('SP64'!D33,'BA-Teilnehmer'!$G$6:$J$69,4,FALSE))","v":{"$error":"#N/A"}},{"$f":"IF(('SP64'!E33)=\"Freilos\",0,VLOOKUP('SP64'!E33,'BA-Teilnehmer'!$G$6:$J$69,4,FALSE))","v":{"$error":"#N/A"}},{"$f":"'SP64'!F33","v":0},{"$f":"'SP64'!G33","v":0},{"$f":"'SP64'!H33","v":0},{"$f":"'SP64'!I33","v":0},{"$f":"'SP64'!J33","v":0},{"$f":"'SP64'!K33","v":0},{"$f":"'SP64'!L33","v":0},{"$f":"'SP64'!AS33","v":"00:00:00"},{"$f":"'SP64'!AT33","v":"00:00:00"}]
["HR",{"$f":"'SP64'!C34","v":32},{"$f":"IF(('SP64'!D34)=\"Freilos\",0,VLOOKUP('SP64'!D34,'BA-Teilnehmer'!$G$6:$J$69,4,FALSE))","v":{"$error":"#N/A"}},{"$f":"IF(('SP64'!E34)=\"Freilos\",0,VLOOKUP('SP64'!E34,'BA-Teilnehmer'!$G$6:$J$69,4,FALSE))","v":{"$error":"#N/A"}},{"$f":"'SP64'!F34","v":0},{"$f":"'SP64'!G34","v":0},{"$f":"'SP64'!H34","v":0},{"$f":"'SP64'!I34","v":0},{"$f":"'SP64'!J34","v":0},{"$f":"'SP64'!K34","v":0},{"$f":"'SP64'!L34","v":0},{"$f":"'SP64'!AS34","v":"00:00:00"},{"$f":"'SP64'!AT34","v":"00:00:00"}]
[{"$f":"'SP64'!B35","v":"VR1"},{"$f":"'SP64'!C35","v":33},{"$f":"IF(('SP64'!D35)=\"Freilos\",0,VLOOKUP('SP64'!D35,'BA-Teilnehmer'!$G$6:$J$69,4,FALSE))","v":{"$error":"#N/A"}},{"$f":"IF(('SP64'!E35)=\"Freilos\",0,VLOOKUP('SP64'!E35,'BA-Teilnehmer'!$G$6:$J$69,4,FALSE))","v":{"$error":"#N/A"}},{"$f":"'SP64'!F35","v":0},{"$f":"'SP64'!G35","v":0},{"$f":"'SP64'!H35","v":0},{"$f":"'SP64'!I35","v":0},{"$f":"'SP64'!J35","v":0},{"$f":"'SP64'!K35","v":0},{"$f":"'SP64'!L35","v":0},{"$f":"'SP64'!AS35","v":"00:00:00"},{"$f":"'SP64'!AT35","v":"00:00:00"}]
[{"$f":"A33","v":"VR1"},{"$f":"'SP64'!C36","v":34},{"$f":"IF(('SP64'!D36)=\"Freilos\",0,VLOOKUP('SP64'!D36,'BA-Teilnehmer'!$G$6:$J$69,4,FALSE))","v":{"$error":"#N/A"}},{"$f":"IF(('SP64'!E36)=\"Freilos\",0,VLOOKUP('SP64'!E36,'BA-Teilnehmer'!$G$6:$J$69,4,FALSE))","v":{"$error":"#N/A"}},{"$f":"'SP64'!F36","v":0},{"$f":"'SP64'!G36","v":0},{"$f":"'SP64'!H36","v":0},{"$f":"'SP64'!I36","v":0},{"$f":"'SP64'!J36","v":0},{"$f":"'SP64'!K36","v":0},{"$f":"'SP64'!L36","v":0},{"$f":"'SP64'!AS36","v":"00:00:00"},{"$f":"'SP64'!AT36","v":"00:00:00"}]
[{"$f":"A34","v":"VR1"},{"$f":"'SP64'!C37","v":35},{"$f":"IF(('SP64'!D37)=\"Freilos\",0,VLOOKUP('SP64'!D37,'BA-Teilnehmer'!$G$6:$J$69,4,FALSE))","v":{"$error":"#N/A"}},{"$f":"IF(('SP64'!E37)=\"Freilos\",0,VLOOKUP('SP64'!E37,'BA-Teilnehmer'!$G$6:$J$69,4,FALSE))","v":{"$error":"#N/A"}},{"$f":"'SP64'!F37","v":0},{"$f":"'SP64'!G37","v":0},{"$f":"'SP64'!H37","v":0},{"$f":"'SP64'!I37","v":0},{"$f":"'SP64'!J37","v":0},{"$f":"'SP64'!K37","v":0},{"$f":"'SP64'!L37","v":0},{"$f":"'SP64'!AS37","v":"00:00:00"},{"$f":"'SP64'!AT37","v":"00:00:00"}]
["VR1",{"$f":"'SP64'!C38","v":36},{"$f":"IF(('SP64'!D38)=\"Freilos\",0,VLOOKUP('SP64'!D38,'BA-Teilnehmer'!$G$6:$J$69,4,FALSE))","v":{"$error":"#N/A"}},{"$f":"IF(('SP64'!E38)=\"Freilos\",0,VLOOKUP('SP64'!E38,'BA-Teilnehmer'!$G$6:$J$69,4,FALSE))","v":{"$error":"#N/A"}},{"$f":"'SP64'!F38","v":0},{"$f":"'SP64'!G38","v":0},{"$f":"'SP64'!H38","v":0},{"$f":"'SP64'!I38","v":0},{"$f":"'SP64'!J38","v":0},{"$f":"'SP64'!K38","v":0},{"$f":"'SP64'!L38","v":0},{"$f":"'SP64'!AS38","v":"00:00:00"},{"$f":"'SP64'!AT38","v":"00:00:00"}]
["VR1",{"$f":"'SP64'!C39","v":37},{"$f":"IF(('SP64'!D39)=\"Freilos\",0,VLOOKUP('SP64'!D39,'BA-Teilnehmer'!$G$6:$J$69,4,FALSE))","v":{"$error":"#N/A"}},{"$f":"IF(('SP64'!E39)=\"Freilos\",0,VLOOKUP('SP64'!E39,'BA-Teilnehmer'!$G$6:$J$69,4,FALSE))","v":{"$error":"#N/A"}},{"$f":"'SP64'!F39","v":0},{"$f":"'SP64'!G39","v":0},{"$f":"'SP64'!H39","v":0},{"$f":"'SP64'!I39","v":0},{"$f":"'SP64'!J39","v":0},{"$f":"'SP64'!K39","v":0},{"$f":"'SP64'!L39","v":0},{"$f":"'SP64'!AS39","v":"00:00:00"},{"$f":"'SP64'!AT39","v":"00:00:00"}]
["VR1",{"$f":"'SP64'!C40","v":38},{"$f":"IF(('SP64'!D40)=\"Freilos\",0,VLOOKUP('SP64'!D40,'BA-Teilnehmer'!$G$6:$J$69,4,FALSE))","v":{"$error":"#N/A"}},{"$f":"IF(('SP64'!E40)=\"Freilos\",0,VLOOKUP('SP64'!E40,'BA-Teilnehmer'!$G$6:$J$69,4,FALSE))","v":{"$error":"#N/A"}},{"$f":"'SP64'!F40","v":0},{"$f":"'SP64'!G40","v":0},{"$f":"'SP64'!H40","v":0},{"$f":"'SP64'!I40","v":0},{"$f":"'SP64'!J40","v":0},{"$f":"'SP64'!K40","v":0},{"$f":"'SP64'!L40","v":0},{"$f":"'SP64'!AS40","v":"00:00:00"},{"$f":"'SP64'!AT40","v":"00:00:00"}]
["VR1",{"$f":"'SP64'!C41","v":39},{"$f":"IF(('SP64'!D41)=\"Freilos\",0,VLOOKUP('SP64'!D41,'BA-Teilnehmer'!$G$6:$J$69,4,FALSE))","v":{"$error":"#N/A"}},{"$f":"IF(('SP64'!E41)=\"Freilos\",0,VLOOKUP('SP64'!E41,'BA-Teilnehmer'!$G$6:$J$69,4,FALSE))","v":{"$error":"#N/A"}},{"$f":"'SP64'!F41","v":0},{"$f":"'SP64'!G41","v":0},{"$f":"'SP64'!H41","v":0},{"$f":"'SP64'!I41","v":0},{"$f":"'SP64'!J41","v":0},{"$f":"'SP64'!K41","v":0},{"$f":"'SP64'!L41","v":0},{"$f":"'SP64'!AS41","v":"00:00:00"},{"$f":"'SP64'!AT41","v":"00:00:00"}]
["VR1",{"$f":"'SP64'!C42","v":40},{"$f":"IF(('SP64'!D42)=\"Freilos\",0,VLOOKUP('SP64'!D42,'BA-Teilnehmer'!$G$6:$J$69,4,FALSE))","v":{"$error":"#N/A"}},{"$f":"IF(('SP64'!E42)=\"Freilos\",0,VLOOKUP('SP64'!E42,'BA-Teilnehmer'!$G$6:$J$69,4,FALSE))","v":{"$error":"#N/A"}},{"$f":"'SP64'!F42","v":0},{"$f":"'SP64'!G42","v":0},{"$f":"'SP64'!H42","v":0},{"$f":"'SP64'!I42","v":0},{"$f":"'SP64'!J42","v":0},{"$f":"'SP64'!K42","v":0},{"$f":"'SP64'!L42","v":0},{"$f":"'SP64'!AS42","v":"00:00:00"},{"$f":"'SP64'!AT42","v":"00:00:00"}]
["VR1",{"$f":"'SP64'!C43","v":41},{"$f":"IF(('SP64'!D43)=\"Freilos\",0,VLOOKUP('SP64'!D43,'BA-Teilnehmer'!$G$6:$J$69,4,FALSE))","v":{"$error":"#N/A"}},{"$f":"IF(('SP64'!E43)=\"Freilos\",0,VLOOKUP('SP64'!E43,'BA-Teilnehmer'!$G$6:$J$69,4,FALSE))","v":{"$error":"#N/A"}},{"$f":"'SP64'!F43","v":0},{"$f":"'SP64'!G43","v":0},{"$f":"'SP64'!H43","v":0},{"$f":"'SP64'!I43","v":0},{"$f":"'SP64'!J43","v":0},{"$f":"'SP64'!K43","v":0},{"$f":"'SP64'!L43","v":0},{"$f":"'SP64'!AS43","v":"00:00:00"},{"$f":"'SP64'!AT43","v":"00:00:00"}]
["VR1",{"$f":"'SP64'!C44","v":42},{"$f":"IF(('SP64'!D44)=\"Freilos\",0,VLOOKUP('SP64'!D44,'BA-Teilnehmer'!$G$6:$J$69,4,FALSE))","v":{"$error":"#N/A"}},{"$f":"IF(('SP64'!E44)=\"Freilos\",0,VLOOKUP('SP64'!E44,'BA-Teilnehmer'!$G$6:$J$69,4,FALSE))","v":{"$error":"#N/A"}},{"$f":"'SP64'!F44","v":0},{"$f":"'SP64'!G44","v":0},{"$f":"'SP64'!H44","v":0},{"$f":"'SP64'!I44","v":0},{"$f":"'SP64'!J44","v":0},{"$f":"'SP64'!K44","v":0},{"$f":"'SP64'!L44","v":0},{"$f":"'SP64'!AS44","v":"00:00:00"},{"$f":"'SP64'!AT44","v":"00:00:00"}]
["VR1",{"$f":"'SP64'!C45","v":43},{"$f":"IF(('SP64'!D45)=\"Freilos\",0,VLOOKUP('SP64'!D45,'BA-Teilnehmer'!$G$6:$J$69,4,FALSE))","v":{"$error":"#N/A"}},{"$f":"IF(('SP64'!E45)=\"Freilos\",0,VLOOKUP('SP64'!E45,'BA-Teilnehmer'!$G$6:$J$69,4,FALSE))","v":{"$error":"#N/A"}},{"$f":"'SP64'!F45","v":0},{"$f":"'SP64'!G45","v":0},{"$f":"'SP64'!H45","v":0},{"$f":"'SP64'!I45","v":0},{"$f":"'SP64'!J45","v":0},{"$f":"'SP64'!K45","v":0},{"$f":"'SP64'!L45","v":0},{"$f":"'SP64'!AS45","v":"00:00:00"},{"$f":"'SP64'!AT45","v":"00:00:00"}]
["VR1",{"$f":"'SP64'!C46","v":44},{"$f":"IF(('SP64'!D46)=\"Freilos\",0,VLOOKUP('SP64'!D46,'BA-Teilnehmer'!$G$6:$J$69,4,FALSE))","v":{"$error":"#N/A"}},{"$f":"IF(('SP64'!E46)=\"Freilos\",0,VLOOKUP('SP64'!E46,'BA-Teilnehmer'!$G$6:$J$69,4,FALSE))","v":{"$error":"#N/A"}},{"$f":"'SP64'!F46","v":0},{"$f":"'SP64'!G46","v":0},{"$f":"'SP64'!H46","v":0},{"$f":"'SP64'!I46","v":0},{"$f":"'SP64'!J46","v":0},{"$f":"'SP64'!K46","v":0},{"$f":"'SP64'!L46","v":0},{"$f":"'SP64'!AS46","v":"00:00:00"},{"$f":"'SP64'!AT46","v":"00:00:00"}]
["VR1",{"$f":"'SP64'!C47","v":45},{"$f":"IF(('SP64'!D47)=\"Freilos\",0,VLOOKUP('SP64'!D47,'BA-Teilnehmer'!$G$6:$J$69,4,FALSE))","v":{"$error":"#N/A"}},{"$f":"IF(('SP64'!E47)=\"Freilos\",0,VLOOKUP('SP64'!E47,'BA-Teilnehmer'!$G$6:$J$69,4,FALSE))","v":{"$error":"#N/A"}},{"$f":"'SP64'!F47","v":0},{"$f":"'SP64'!G47","v":0},{"$f":"'SP64'!H47","v":0},{"$f":"'SP64'!I47","v":0},{"$f":"'SP64'!J47","v":0},{"$f":"'SP64'!K47","v":0},{"$f":"'SP64'!L47","v":0},{"$f":"'SP64'!AS47","v":"00:00:00"},{"$f":"'SP64'!AT47","v":"00:00:00"}]
["VR1",{"$f":"'SP64'!C48","v":46},{"$f":"IF(('SP64'!D48)=\"Freilos\",0,VLOOKUP('SP64'!D48,'BA-Teilnehmer'!$G$6:$J$69,4,FALSE))","v":{"$error":"#N/A"}},{"$f":"IF(('SP64'!E48)=\"Freilos\",0,VLOOKUP('SP64'!E48,'BA-Teilnehmer'!$G$6:$J$69,4,FALSE))","v":{"$error":"#N/A"}},{"$f":"'SP64'!F48","v":0},{"$f":"'SP64'!G48","v":0},{"$f":"'SP64'!H48","v":0},{"$f":"'SP64'!I48","v":0},{"$f":"'SP64'!J48","v":0},{"$f":"'SP64'!K48","v":0},{"$f":"'SP64'!L48","v":0},{"$f":"'SP64'!AS48","v":"00:00:00"},{"$f":"'SP64'!AT48","v":"00:00:00"}]
["VR1",{"$f":"'SP64'!C49","v":47},{"$f":"IF(('SP64'!D49)=\"Freilos\",0,VLOOKUP('SP64'!D49,'BA-Teilnehmer'!$G$6:$J$69,4,FALSE))","v":{"$error":"#N/A"}},{"$f":"IF(('SP64'!E49)=\"Freilos\",0,VLOOKUP('SP64'!E49,'BA-Teilnehmer'!$G$6:$J$69,4,FALSE))","v":{"$error":"#N/A"}},{"$f":"'SP64'!F49","v":0},{"$f":"'SP64'!G49","v":0},{"$f":"'SP64'!H49","v":0},{"$f":"'SP64'!I49","v":0},{"$f":"'SP64'!J49","v":0},{"$f":"'SP64'!K49","v":0},{"$f":"'SP64'!L49","v":0},{"$f":"'SP64'!AS49","v":"00:00:00"},{"$f":"'SP64'!AT49","v":"00:00:00"}]
["VR1",{"$f":"'SP64'!C50","v":48},{"$f":"IF(('SP64'!D50)=\"Freilos\",0,VLOOKUP('SP64'!D50,'BA-Teilnehmer'!$G$6:$J$69,4,FALSE))","v":{"$error":"#N/A"}},{"$f":"IF(('SP64'!E50)=\"Freilos\",0,VLOOKUP('SP64'!E50,'BA-Teilnehmer'!$G$6:$J$69,4,FALSE))","v":{"$error":"#N/A"}},{"$f":"'SP64'!F50","v":0},{"$f":"'SP64'!G50","v":0},{"$f":"'SP64'!H50","v":0},{"$f":"'SP64'!I50","v":0},{"$f":"'SP64'!J50","v":0},{"$f":"'SP64'!K50","v":0},{"$f":"'SP64'!L50","v":0},{"$f":"'SP64'!AS50","v":"00:00:00"},{"$f":"'SP64'!AT50","v":"00:00:00"}]
[{"$f":"'SP64'!B51","v":"GR1"},{"$f":"'SP64'!C51","v":49},{"$f":"IF(('SP64'!D51)=\"Freilos\",0,VLOOKUP('SP64'!D51,'BA-Teilnehmer'!$G$6:$J$69,4,FALSE))","v":{"$error":"#N/A"}},{"$f":"IF(('SP64'!E51)=\"Freilos\",0,VLOOKUP('SP64'!E51,'BA-Teilnehmer'!$G$6:$J$69,4,FALSE))","v":{"$error":"#N/A"}},{"$f":"'SP64'!F51","v":0},{"$f":"'SP64'!G51","v":0},{"$f":"'SP64'!H51","v":0},{"$f":"'SP64'!I51","v":0},{"$f":"'SP64'!J51","v":0},{"$f":"'SP64'!K51","v":0},{"$f":"'SP64'!L51","v":0},{"$f":"'SP64'!AS51","v":"00:00:00"},{"$f":"'SP64'!AT51","v":"00:00:00"}]
[{"$f":"$A$49","v":"GR1"},{"$f":"'SP64'!C52","v":50},{"$f":"IF(('SP64'!D52)=\"Freilos\",0,VLOOKUP('SP64'!D52,'BA-Teilnehmer'!$G$6:$J$69,4,FALSE))","v":{"$error":"#N/A"}},{"$f":"IF(('SP64'!E52)=\"Freilos\",0,VLOOKUP('SP64'!E52,'BA-Teilnehmer'!$G$6:$J$69,4,FALSE))","v":{"$error":"#N/A"}},{"$f":"'SP64'!F52","v":0},{"$f":"'SP64'!G52","v":0},{"$f":"'SP64'!H52","v":0},{"$f":"'SP64'!I52","v":0},{"$f":"'SP64'!J52","v":0},{"$f":"'SP64'!K52","v":0},{"$f":"'SP64'!L52","v":0},{"$f":"'SP64'!AS52","v":"00:00:00"},{"$f":"'SP64'!AT52","v":"00:00:00"}]
[{"$f":"$A$49","v":"GR1"},{"$f":"'SP64'!C53","v":51},{"$f":"IF(('SP64'!D53)=\"Freilos\",0,VLOOKUP('SP64'!D53,'BA-Teilnehmer'!$G$6:$J$69,4,FALSE))","v":{"$error":"#N/A"}},{"$f":"IF(('SP64'!E53)=\"Freilos\",0,VLOOKUP('SP64'!E53,'BA-Teilnehmer'!$G$6:$J$69,4,FALSE))","v":{"$error":"#N/A"}},{"$f":"'SP64'!F53","v":0},{"$f":"'SP64'!G53","v":0},{"$f":"'SP64'!H53","v":0},{"$f":"'SP64'!I53","v":0},{"$f":"'SP64'!J53","v":0},{"$f":"'SP64'!K53","v":0},{"$f":"'SP64'!L53","v":0},{"$f":"'SP64'!AS53","v":"00:00:00"},{"$f":"'SP64'!AT53","v":"00:00:00"}]
["GR1",{"$f":"'SP64'!C54","v":52},{"$f":"IF(('SP64'!D54)=\"Freilos\",0,VLOOKUP('SP64'!D54,'BA-Teilnehmer'!$G$6:$J$69,4,FALSE))","v":{"$error":"#N/A"}},{"$f":"IF(('SP64'!E54)=\"Freilos\",0,VLOOKUP('SP64'!E54,'BA-Teilnehmer'!$G$6:$J$69,4,FALSE))","v":{"$error":"#N/A"}},{"$f":"'SP64'!F54","v":0},{"$f":"'SP64'!G54","v":0},{"$f":"'SP64'!H54","v":0},{"$f":"'SP64'!I54","v":0},{"$f":"'SP64'!J54","v":0},{"$f":"'SP64'!K54","v":0},{"$f":"'SP64'!L54","v":0},{"$f":"'SP64'!AS54","v":"00:00:00"},{"$f":"'SP64'!AT54","v":"00:00:00"}]
["GR1",{"$f":"'SP64'!C55","v":53},{"$f":"IF(('SP64'!D55)=\"Freilos\",0,VLOOKUP('SP64'!D55,'BA-Teilnehmer'!$G$6:$J$69,4,FALSE))","v":{"$error":"#N/A"}},{"$f":"IF(('SP64'!E55)=\"Freilos\",0,VLOOKUP('SP64'!E55,'BA-Teilnehmer'!$G$6:$J$69,4,FALSE))","v":{"$error":"#N/A"}},{"$f":"'SP64'!F55","v":0},{"$f":"'SP64'!G55","v":0},{"$f":"'SP64'!H55","v":0},{"$f":"'SP64'!I55","v":0},{"$f":"'SP64'!J55","v":0},{"$f":"'SP64'!K55","v":0},{"$f":"'SP64'!L55","v":0},{"$f":"'SP64'!AS55","v":"00:00:00"},{"$f":"'SP64'!AT55","v":"00:00:00"}]
["GR1",{"$f":"'SP64'!C56","v":54},{"$f":"IF(('SP64'!D56)=\"Freilos\",0,VLOOKUP('SP64'!D56,'BA-Teilnehmer'!$G$6:$J$69,4,FALSE))","v":{"$error":"#N/A"}},{"$f":"IF(('SP64'!E56)=\"Freilos\",0,VLOOKUP('SP64'!E56,'BA-Teilnehmer'!$G$6:$J$69,4,FALSE))","v":{"$error":"#N/A"}},{"$f":"'SP64'!F56","v":0},{"$f":"'SP64'!G56","v":0},{"$f":"'SP64'!H56","v":0},{"$f":"'SP64'!I56","v":0},{"$f":"'SP64'!J56","v":0},{"$f":"'SP64'!K56","v":0},{"$f":"'SP64'!L56","v":0},{"$f":"'SP64'!AS56","v":"00:00:00"},{"$f":"'SP64'!AT56","v":"00:00:00"}]
["GR1",{"$f":"'SP64'!C57","v":55},{"$f":"IF(('SP64'!D57)=\"Freilos\",0,VLOOKUP('SP64'!D57,'BA-Teilnehmer'!$G$6:$J$69,4,FALSE))","v":{"$error":"#N/A"}},{"$f":"IF(('SP64'!E57)=\"Freilos\",0,VLOOKUP('SP64'!E57,'BA-Teilnehmer'!$G$6:$J$69,4,FALSE))","v":{"$error":"#N/A"}},{"$f":"'SP64'!F57","v":0},{"$f":"'SP64'!G57","v":0},{"$f":"'SP64'!H57","v":0},{"$f":"'SP64'!I57","v":0},{"$f":"'SP64'!J57","v":0},{"$f":"'SP64'!K57","v":0},{"$f":"'SP64'!L57","v":0},{"$f":"'SP64'!AS57","v":"00:00:00"},{"$f":"'SP64'!AT57","v":"00:00:00"}]
["GR1",{"$f":"'SP64'!C58","v":56},{"$f":"IF(('SP64'!D58)=\"Freilos\",0,VLOOKUP('SP64'!D58,'BA-Teilnehmer'!$G$6:$J$69,4,FALSE))","v":{"$error":"#N/A"}},{"$f":"IF(('SP64'!E58)=\"Freilos\",0,VLOOKUP('SP64'!E58,'BA-Teilnehmer'!$G$6:$J$69,4,FALSE))","v":{"$error":"#N/A"}},{"$f":"'SP64'!F58","v":0},{"$f":"'SP64'!G58","v":0},{"$f":"'SP64'!H58","v":0},{"$f":"'SP64'!I58","v":0},{"$f":"'SP64'!J58","v":0},{"$f":"'SP64'!K58","v":0},{"$f":"'SP64'!L58","v":0},{"$f":"'SP64'!AS58","v":"00:00:00"},{"$f":"'SP64'!AT58","v":"00:00:00"}]
["GR1",{"$f":"'SP64'!C59","v":57},{"$f":"IF(('SP64'!D59)=\"Freilos\",0,VLOOKUP('SP64'!D59,'BA-Teilnehmer'!$G$6:$J$69,4,FALSE))","v":{"$error":"#N/A"}},{"$f":"IF(('SP64'!E59)=\"Freilos\",0,VLOOKUP('SP64'!E59,'BA-Teilnehmer'!$G$6:$J$69,4,FALSE))","v":{"$error":"#N/A"}},{"$f":"'SP64'!F59","v":0},{"$f":"'SP64'!G59","v":0},{"$f":"'SP64'!H59","v":0},{"$f":"'SP64'!I59","v":0},{"$f":"'SP64'!J59","v":0},{"$f":"'SP64'!K59","v":0},{"$f":"'SP64'!L59","v":0},{"$f":"'SP64'!AS59","v":"00:00:00"},{"$f":"'SP64'!AT59","v":"00:00:00"}]
["GR1",{"$f":"'SP64'!C60","v":58},{"$f":"IF(('SP64'!D60)=\"Freilos\",0,VLOOKUP('SP64'!D60,'BA-Teilnehmer'!$G$6:$J$69,4,FALSE))","v":{"$error":"#N/A"}},{"$f":"IF(('SP64'!E60)=\"Freilos\",0,VLOOKUP('SP64'!E60,'BA-Teilnehmer'!$G$6:$J$69,4,FALSE))","v":{"$error":"#N/A"}},{"$f":"'SP64'!F60","v":0},{"$f":"'SP64'!G60","v":0},{"$f":"'SP64'!H60","v":0},{"$f":"'SP64'!I60","v":0},{"$f":"'SP64'!J60","v":0},{"$f":"'SP64'!K60","v":0},{"$f":"'SP64'!L60","v":0},{"$f":"'SP64'!AS60","v":"00:00:00"},{"$f":"'SP64'!AT60","v":"00:00:00"}]
["GR1",{"$f":"'SP64'!C61","v":59},{"$f":"IF(('SP64'!D61)=\"Freilos\",0,VLOOKUP('SP64'!D61,'BA-Teilnehmer'!$G$6:$J$69,4,FALSE))","v":{"$error":"#N/A"}},{"$f":"IF(('SP64'!E61)=\"Freilos\",0,VLOOKUP('SP64'!E61,'BA-Teilnehmer'!$G$6:$J$69,4,FALSE))","v":{"$error":"#N/A"}},{"$f":"'SP64'!F61","v":0},{"$f":"'SP64'!G61","v":0},{"$f":"'SP64'!H61","v":0},{"$f":"'SP64'!I61","v":0},{"$f":"'SP64'!J61","v":0},{"$f":"'SP64'!K61","v":0},{"$f":"'SP64'!L61","v":0},{"$f":"'SP64'!AS61","v":"00:00:00"},{"$f":"'SP64'!AT61","v":"00:00:00"}]
["GR1",{"$f":"'SP64'!C62","v":60},{"$f":"IF(('SP64'!D62)=\"Freilos\",0,VLOOKUP('SP64'!D62,'BA-Teilnehmer'!$G$6:$J$69,4,FALSE))","v":{"$error":"#N/A"}},{"$f":"IF(('SP64'!E62)=\"Freilos\",0,VLOOKUP('SP64'!E62,'BA-Teilnehmer'!$G$6:$J$69,4,FALSE))","v":{"$error":"#N/A"}},{"$f":"'SP64'!F62","v":0},{"$f":"'SP64'!G62","v":0},{"$f":"'SP64'!H62","v":0},{"$f":"'SP64'!I62","v":0},{"$f":"'SP64'!J62","v":0},{"$f":"'SP64'!K62","v":0},{"$f":"'SP64'!L62","v":0},{"$f":"'SP64'!AS62","v":"00:00:00"},{"$f":"'SP64'!AT62","v":"00:00:00"}]
["GR1",{"$f":"'SP64'!C63","v":61},{"$f":"IF(('SP64'!D63)=\"Freilos\",0,VLOOKUP('SP64'!D63,'BA-Teilnehmer'!$G$6:$J$69,4,FALSE))","v":{"$error":"#N/A"}},{"$f":"IF(('SP64'!E63)=\"Freilos\",0,VLOOKUP('SP64'!E63,'BA-Teilnehmer'!$G$6:$J$69,4,FALSE))","v":{"$error":"#N/A"}},{"$f":"'SP64'!F63","v":0},{"$f":"'SP64'!G63","v":0},{"$f":"'SP64'!H63","v":0},{"$f":"'SP64'!I63","v":0},{"$f":"'SP64'!J63","v":0},{"$f":"'SP64'!K63","v":0},{"$f":"'SP64'!L63","v":0},{"$f":"'SP64'!AS63","v":"00:00:00"},{"$f":"'SP64'!AT63","v":"00:00:00"}]
["GR1",{"$f":"'SP64'!C64","v":62},{"$f":"IF(('SP64'!D64)=\"Freilos\",0,VLOOKUP('SP64'!D64,'BA-Teilnehmer'!$G$6:$J$69,4,FALSE))","v":{"$error":"#N/A"}},{"$f":"IF(('SP64'!E64)=\"Freilos\",0,VLOOKUP('SP64'!E64,'BA-Teilnehmer'!$G$6:$J$69,4,FALSE))","v":{"$error":"#N/A"}},{"$f":"'SP64'!F64","v":0},{"$f":"'SP64'!G64","v":0},{"$f":"'SP64'!H64","v":0},{"$f":"'SP64'!I64","v":0},{"$f":"'SP64'!J64","v":0},{"$f":"'SP64'!K64","v":0},{"$f":"'SP64'!L64","v":0},{"$f":"'SP64'!AS64","v":"00:00:00"},{"$f":"'SP64'!AT64","v":"00:00:00"}]
["GR1",{"$f":"'SP64'!C65","v":63},{"$f":"IF(('SP64'!D65)=\"Freilos\",0,VLOOKUP('SP64'!D65,'BA-Teilnehmer'!$G$6:$J$69,4,FALSE))","v":{"$error":"#N/A"}},{"$f":"IF(('SP64'!E65)=\"Freilos\",0,VLOOKUP('SP64'!E65,'BA-Teilnehmer'!$G$6:$J$69,4,FALSE))","v":{"$error":"#N/A"}},{"$f":"'SP64'!F65","v":0},{"$f":"'SP64'!G65","v":0},{"$f":"'SP64'!H65","v":0},{"$f":"'SP64'!I65","v":0},{"$f":"'SP64'!J65","v":0},{"$f":"'SP64'!K65","v":0},{"$f":"'SP64'!L65","v":0},{"$f":"'SP64'!AS65","v":"00:00:00"},{"$f":"'SP64'!AT65","v":"00:00:00"}]
["GR1",{"$f":"'SP64'!C66","v":64},{"$f":"IF(('SP64'!D66)=\"Freilos\",0,VLOOKUP('SP64'!D66,'BA-Teilnehmer'!$G$6:$J$69,4,FALSE))","v":{"$error":"#N/A"}},{"$f":"IF(('SP64'!E66)=\"Freilos\",0,VLOOKUP('SP64'!E66,'BA-Teilnehmer'!$G$6:$J$69,4,FALSE))","v":{"$error":"#N/A"}},{"$f":"'SP64'!F66","v":0},{"$f":"'SP64'!G66","v":0},{"$f":"'SP64'!H66","v":0},{"$f":"'SP64'!I66","v":0},{"$f":"'SP64'!J66","v":0},{"$f":"'SP64'!K66","v":0},{"$f":"'SP64'!L66","v":0},{"$f":"'SP64'!AS66","v":"00:00:00"},{"$f":"'SP64'!AT66","v":"00:00:00"}]
[{"$f":"'SP64'!B67","v":"VR2"},{"$f":"'SP64'!C67","v":65},{"$f":"IF(('SP64'!D67)=\"Freilos\",0,VLOOKUP('SP64'!D67,'BA-Teilnehmer'!$G$6:$J$69,4,FALSE))","v":{"$error":"#N/A"}},{"$f":"IF(('SP64'!E67)=\"Freilos\",0,VLOOKUP('SP64'!E67,'BA-Teilnehmer'!$G$6:$J$69,4,FALSE))","v":{"$error":"#N/A"}},{"$f":"'SP64'!F67","v":0},{"$f":"'SP64'!G67","v":0},{"$f":"'SP64'!H67","v":0},{"$f":"'SP64'!I67","v":0},{"$f":"'SP64'!J67","v":0},{"$f":"'SP64'!K67","v":0},{"$f":"'SP64'!L67","v":0},{"$f":"'SP64'!AS67","v":"00:00:00"},{"$f":"'SP64'!AT67","v":"00:00:00"}]
[{"$f":"$A$65","v":"VR2"},{"$f":"'SP64'!C68","v":66},{"$f":"IF(('SP64'!D68)=\"Freilos\",0,VLOOKUP('SP64'!D68,'BA-Teilnehmer'!$G$6:$J$69,4,FALSE))","v":{"$error":"#N/A"}},{"$f":"IF(('SP64'!E68)=\"Freilos\",0,VLOOKUP('SP64'!E68,'BA-Teilnehmer'!$G$6:$J$69,4,FALSE))","v":{"$error":"#N/A"}},{"$f":"'SP64'!F68","v":0},{"$f":"'SP64'!G68","v":0},{"$f":"'SP64'!H68","v":0},{"$f":"'SP64'!I68","v":0},{"$f":"'SP64'!J68","v":0},{"$f":"'SP64'!K68","v":0},{"$f":"'SP64'!L68","v":0},{"$f":"'SP64'!AS68","v":"00:00:00"},{"$f":"'SP64'!AT68","v":"00:00:00"}]
[{"$f":"$A$65","v":"VR2"},{"$f":"'SP64'!C69","v":67},{"$f":"IF(('SP64'!D69)=\"Freilos\",0,VLOOKUP('SP64'!D69,'BA-Teilnehmer'!$G$6:$J$69,4,FALSE))","v":{"$error":"#N/A"}},{"$f":"IF(('SP64'!E69)=\"Freilos\",0,VLOOKUP('SP64'!E69,'BA-Teilnehmer'!$G$6:$J$69,4,FALSE))","v":{"$error":"#N/A"}},{"$f":"'SP64'!F69","v":0},{"$f":"'SP64'!G69","v":0},{"$f":"'SP64'!H69","v":0},{"$f":"'SP64'!I69","v":0},{"$f":"'SP64'!J69","v":0},{"$f":"'SP64'!K69","v":0},{"$f":"'SP64'!L69","v":0},{"$f":"'SP64'!AS69","v":"00:00:00"},{"$f":"'SP64'!AT69","v":"00:00:00"}]
["VR2",{"$f":"'SP64'!C70","v":68},{"$f":"IF(('SP64'!D70)=\"Freilos\",0,VLOOKUP('SP64'!D70,'BA-Teilnehmer'!$G$6:$J$69,4,FALSE))","v":{"$error":"#N/A"}},{"$f":"IF(('SP64'!E70)=\"Freilos\",0,VLOOKUP('SP64'!E70,'BA-Teilnehmer'!$G$6:$J$69,4,FALSE))","v":{"$error":"#N/A"}},{"$f":"'SP64'!F70","v":0},{"$f":"'SP64'!G70","v":0},{"$f":"'SP64'!H70","v":0},{"$f":"'SP64'!I70","v":0},{"$f":"'SP64'!J70","v":0},{"$f":"'SP64'!K70","v":0},{"$f":"'SP64'!L70","v":0},{"$f":"'SP64'!AS70","v":"00:00:00"},{"$f":"'SP64'!AT70","v":"00:00:00"}]
["VR2",{"$f":"'SP64'!C71","v":69},{"$f":"IF(('SP64'!D71)=\"Freilos\",0,VLOOKUP('SP64'!D71,'BA-Teilnehmer'!$G$6:$J$69,4,FALSE))","v":{"$error":"#N/A"}},{"$f":"IF(('SP64'!E71)=\"Freilos\",0,VLOOKUP('SP64'!E71,'BA-Teilnehmer'!$G$6:$J$69,4,FALSE))","v":{"$error":"#N/A"}},{"$f":"'SP64'!F71","v":0},{"$f":"'SP64'!G71","v":0},{"$f":"'SP64'!H71","v":0},{"$f":"'SP64'!I71","v":0},{"$f":"'SP64'!J71","v":0},{"$f":"'SP64'!K71","v":0},{"$f":"'SP64'!L71","v":0},{"$f":"'SP64'!AS71","v":"00:00:00"},{"$f":"'SP64'!AT71","v":"00:00:00"}]
["VR2",{"$f":"'SP64'!C72","v":70},{"$f":"IF(('SP64'!D72)=\"Freilos\",0,VLOOKUP('SP64'!D72,'BA-Teilnehmer'!$G$6:$J$69,4,FALSE))","v":{"$error":"#N/A"}},{"$f":"IF(('SP64'!E72)=\"Freilos\",0,VLOOKUP('SP64'!E72,'BA-Teilnehmer'!$G$6:$J$69,4,FALSE))","v":{"$error":"#N/A"}},{"$f":"'SP64'!F72","v":0},{"$f":"'SP64'!G72","v":0},{"$f":"'SP64'!H72","v":0},{"$f":"'SP64'!I72","v":0},{"$f":"'SP64'!J72","v":0},{"$f":"'SP64'!K72","v":0},{"$f":"'SP64'!L72","v":0},{"$f":"'SP64'!AS72","v":"00:00:00"},{"$f":"'SP64'!AT72","v":"00:00:00"}]
["VR2",{"$f":"'SP64'!C73","v":71},{"$f":"IF(('SP64'!D73)=\"Freilos\",0,VLOOKUP('SP64'!D73,'BA-Teilnehmer'!$G$6:$J$69,4,FALSE))","v":{"$error":"#N/A"}},{"$f":"IF(('SP64'!E73)=\"Freilos\",0,VLOOKUP('SP64'!E73,'BA-Teilnehmer'!$G$6:$J$69,4,FALSE))","v":{"$error":"#N/A"}},{"$f":"'SP64'!F73","v":0},{"$f":"'SP64'!G73","v":0},{"$f":"'SP64'!H73","v":0},{"$f":"'SP64'!I73","v":0},{"$f":"'SP64'!J73","v":0},{"$f":"'SP64'!K73","v":0},{"$f":"'SP64'!L73","v":0},{"$f":"'SP64'!AS73","v":"00:00:00"},{"$f":"'SP64'!AT73","v":"00:00:00"}]
["VR2",{"$f":"'SP64'!C74","v":72},{"$f":"IF(('SP64'!D74)=\"Freilos\",0,VLOOKUP('SP64'!D74,'BA-Teilnehmer'!$G$6:$J$69,4,FALSE))","v":{"$error":"#N/A"}},{"$f":"IF(('SP64'!E74)=\"Freilos\",0,VLOOKUP('SP64'!E74,'BA-Teilnehmer'!$G$6:$J$69,4,FALSE))","v":{"$error":"#N/A"}},{"$f":"'SP64'!F74","v":0},{"$f":"'SP64'!G74","v":0},{"$f":"'SP64'!H74","v":0},{"$f":"'SP64'!I74","v":0},{"$f":"'SP64'!J74","v":0},{"$f":"'SP64'!K74","v":0},{"$f":"'SP64'!L74","v":0},{"$f":"'SP64'!AS74","v":"00:00:00"},{"$f":"'SP64'!AT74","v":"00:00:00"}]
["VR2",{"$f":"'SP64'!C75","v":73},{"$f":"IF(('SP64'!D75)=\"Freilos\",0,VLOOKUP('SP64'!D75,'BA-Teilnehmer'!$G$6:$J$69,4,FALSE))","v":{"$error":"#N/A"}},{"$f":"IF(('SP64'!E75)=\"Freilos\",0,VLOOKUP('SP64'!E75,'BA-Teilnehmer'!$G$6:$J$69,4,FALSE))","v":{"$error":"#N/A"}},{"$f":"'SP64'!F75","v":0},{"$f":"'SP64'!G75","v":0},{"$f":"'SP64'!H75","v":0},{"$f":"'SP64'!I75","v":0},{"$f":"'SP64'!J75","v":0},{"$f":"'SP64'!K75","v":0},{"$f":"'SP64'!L75","v":0},{"$f":"'SP64'!AS75","v":"00:00:00"},{"$f":"'SP64'!AT75","v":"00:00:00"}]
["VR2",{"$f":"'SP64'!C76","v":74},{"$f":"IF(('SP64'!D76)=\"Freilos\",0,VLOOKUP('SP64'!D76,'BA-Teilnehmer'!$G$6:$J$69,4,FALSE))","v":{"$error":"#N/A"}},{"$f":"IF(('SP64'!E76)=\"Freilos\",0,VLOOKUP('SP64'!E76,'BA-Teilnehmer'!$G$6:$J$69,4,FALSE))","v":{"$error":"#N/A"}},{"$f":"'SP64'!F76","v":0},{"$f":"'SP64'!G76","v":0},{"$f":"'SP64'!H76","v":0},{"$f":"'SP64'!I76","v":0},{"$f":"'SP64'!J76","v":0},{"$f":"'SP64'!K76","v":0},{"$f":"'SP64'!L76","v":0},{"$f":"'SP64'!AS76","v":"00:00:00"},{"$f":"'SP64'!AT76","v":"00:00:00"}]
["VR2",{"$f":"'SP64'!C77","v":75},{"$f":"IF(('SP64'!D77)=\"Freilos\",0,VLOOKUP('SP64'!D77,'BA-Teilnehmer'!$G$6:$J$69,4,FALSE))","v":{"$error":"#N/A"}},{"$f":"IF(('SP64'!E77)=\"Freilos\",0,VLOOKUP('SP64'!E77,'BA-Teilnehmer'!$G$6:$J$69,4,FALSE))","v":{"$error":"#N/A"}},{"$f":"'SP64'!F77","v":0},{"$f":"'SP64'!G77","v":0},{"$f":"'SP64'!H77","v":0},{"$f":"'SP64'!I77","v":0},{"$f":"'SP64'!J77","v":0},{"$f":"'SP64'!K77","v":0},{"$f":"'SP64'!L77","v":0},{"$f":"'SP64'!AS77","v":"00:00:00"},{"$f":"'SP64'!AT77","v":"00:00:00"}]
["VR2",{"$f":"'SP64'!C78","v":76},{"$f":"IF(('SP64'!D78)=\"Freilos\",0,VLOOKUP('SP64'!D78,'BA-Teilnehmer'!$G$6:$J$69,4,FALSE))","v":{"$error":"#N/A"}},{"$f":"IF(('SP64'!E78)=\"Freilos\",0,VLOOKUP('SP64'!E78,'BA-Teilnehmer'!$G$6:$J$69,4,FALSE))","v":{"$error":"#N/A"}},{"$f":"'SP64'!F78","v":0},{"$f":"'SP64'!G78","v":0},{"$f":"'SP64'!H78","v":0},{"$f":"'SP64'!I78","v":0},{"$f":"'SP64'!J78","v":0},{"$f":"'SP64'!K78","v":0},{"$f":"'SP64'!L78","v":0},{"$f":"'SP64'!AS78","v":"00:00:00"},{"$f":"'SP64'!AT78","v":"00:00:00"}]
["VR2",{"$f":"'SP64'!C79","v":77},{"$f":"IF(('SP64'!D79)=\"Freilos\",0,VLOOKUP('SP64'!D79,'BA-Teilnehmer'!$G$6:$J$69,4,FALSE))","v":{"$error":"#N/A"}},{"$f":"IF(('SP64'!E79)=\"Freilos\",0,VLOOKUP('SP64'!E79,'BA-Teilnehmer'!$G$6:$J$69,4,FALSE))","v":{"$error":"#N/A"}},{"$f":"'SP64'!F79","v":0},{"$f":"'SP64'!G79","v":0},{"$f":"'SP64'!H79","v":0},{"$f":"'SP64'!I79","v":0},{"$f":"'SP64'!J79","v":0},{"$f":"'SP64'!K79","v":0},{"$f":"'SP64'!L79","v":0},{"$f":"'SP64'!AS79","v":"00:00:00"},{"$f":"'SP64'!AT79","v":"00:00:00"}]
["VR2",{"$f":"'SP64'!C80","v":78},{"$f":"IF(('SP64'!D80)=\"Freilos\",0,VLOOKUP('SP64'!D80,'BA-Teilnehmer'!$G$6:$J$69,4,FALSE))","v":{"$error":"#N/A"}},{"$f":"IF(('SP64'!E80)=\"Freilos\",0,VLOOKUP('SP64'!E80,'BA-Teilnehmer'!$G$6:$J$69,4,FALSE))","v":{"$error":"#N/A"}},{"$f":"'SP64'!F80","v":0},{"$f":"'SP64'!G80","v":0},{"$f":"'SP64'!H80","v":0},{"$f":"'SP64'!I80","v":0},{"$f":"'SP64'!J80","v":0},{"$f":"'SP64'!K80","v":0},{"$f":"'SP64'!L80","v":0},{"$f":"'SP64'!AS80","v":"00:00:00"},{"$f":"'SP64'!AT80","v":"00:00:00"}]
["VR2",{"$f":"'SP64'!C81","v":79},{"$f":"IF(('SP64'!D81)=\"Freilos\",0,VLOOKUP('SP64'!D81,'BA-Teilnehmer'!$G$6:$J$69,4,FALSE))","v":{"$error":"#N/A"}},{"$f":"IF(('SP64'!E81)=\"Freilos\",0,VLOOKUP('SP64'!E81,'BA-Teilnehmer'!$G$6:$J$69,4,FALSE))","v":{"$error":"#N/A"}},{"$f":"'SP64'!F81","v":0},{"$f":"'SP64'!G81","v":0},{"$f":"'SP64'!H81","v":0},{"$f":"'SP64'!I81","v":0},{"$f":"'SP64'!J81","v":0},{"$f":"'SP64'!K81","v":0},{"$f":"'SP64'!L81","v":0},{"$f":"'SP64'!AS81","v":"00:00:00"},{"$f":"'SP64'!AT81","v":"00:00:00"}]
["VR2",{"$f":"'SP64'!C82","v":80},{"$f":"IF(('SP64'!D82)=\"Freilos\",0,VLOOKUP('SP64'!D82,'BA-Teilnehmer'!$G$6:$J$69,4,FALSE))","v":{"$error":"#N/A"}},{"$f":"IF(('SP64'!E82)=\"Freilos\",0,VLOOKUP('SP64'!E82,'BA-Teilnehmer'!$G$6:$J$69,4,FALSE))","v":{"$error":"#N/A"}},{"$f":"'SP64'!F82","v":0},{"$f":"'SP64'!G82","v":0},{"$f":"'SP64'!H82","v":0},{"$f":"'SP64'!I82","v":0},{"$f":"'SP64'!J82","v":0},{"$f":"'SP64'!K82","v":0},{"$f":"'SP64'!L82","v":0},{"$f":"'SP64'!AS82","v":"00:00:00"},{"$f":"'SP64'!AT82","v":"00:00:00"}]
[{"$f":"'SP64'!B83","v":"VR3"},{"$f":"'SP64'!C83","v":81},{"$f":"IF(('SP64'!D83)=\"Freilos\",0,VLOOKUP('SP64'!D83,'BA-Teilnehmer'!$G$6:$J$69,4,FALSE))","v":{"$error":"#N/A"}},{"$f":"IF(('SP64'!E83)=\"Freilos\",0,VLOOKUP('SP64'!E83,'BA-Teilnehmer'!$G$6:$J$69,4,FALSE))","v":{"$error":"#N/A"}},{"$f":"'SP64'!F83","v":0},{"$f":"'SP64'!G83","v":0},{"$f":"'SP64'!H83","v":0},{"$f":"'SP64'!I83","v":0},{"$f":"'SP64'!J83","v":0},{"$f":"'SP64'!K83","v":0},{"$f":"'SP64'!L83","v":0},{"$f":"'SP64'!AS83","v":"00:00:00"},{"$f":"'SP64'!AT83","v":"00:00:00"}]
[{"$f":"$A$81","v":"VR3"},{"$f":"'SP64'!C84","v":82},{"$f":"IF(('SP64'!D84)=\"Freilos\",0,VLOOKUP('SP64'!D84,'BA-Teilnehmer'!$G$6:$J$69,4,FALSE))","v":{"$error":"#N/A"}},{"$f":"IF(('SP64'!E84)=\"Freilos\",0,VLOOKUP('SP64'!E84,'BA-Teilnehmer'!$G$6:$J$69,4,FALSE))","v":{"$error":"#N/A"}},{"$f":"'SP64'!F84","v":0},{"$f":"'SP64'!G84","v":0},{"$f":"'SP64'!H84","v":0},{"$f":"'SP64'!I84","v":0},{"$f":"'SP64'!J84","v":0},{"$f":"'SP64'!K84","v":0},{"$f":"'SP64'!L84","v":0},{"$f":"'SP64'!AS84","v":"00:00:00"},{"$f":"'SP64'!AT84","v":"00:00:00"}]
[{"$f":"$A$81","v":"VR3"},{"$f":"'SP64'!C85","v":83},{"$f":"IF(('SP64'!D85)=\"Freilos\",0,VLOOKUP('SP64'!D85,'BA-Teilnehmer'!$G$6:$J$69,4,FALSE))","v":{"$error":"#N/A"}},{"$f":"IF(('SP64'!E85)=\"Freilos\",0,VLOOKUP('SP64'!E85,'BA-Teilnehmer'!$G$6:$J$69,4,FALSE))","v":{"$error":"#N/A"}},{"$f":"'SP64'!F85","v":0},{"$f":"'SP64'!G85","v":0},{"$f":"'SP64'!H85","v":0},{"$f":"'SP64'!I85","v":0},{"$f":"'SP64'!J85","v":0},{"$f":"'SP64'!K85","v":0},{"$f":"'SP64'!L85","v":0},{"$f":"'SP64'!AS85","v":"00:00:00"},{"$f":"'SP64'!AT85","v":"00:00:00"}]
["VR3",{"$f":"'SP64'!C86","v":84},{"$f":"IF(('SP64'!D86)=\"Freilos\",0,VLOOKUP('SP64'!D86,'BA-Teilnehmer'!$G$6:$J$69,4,FALSE))","v":{"$error":"#N/A"}},{"$f":"IF(('SP64'!E86)=\"Freilos\",0,VLOOKUP('SP64'!E86,'BA-Teilnehmer'!$G$6:$J$69,4,FALSE))","v":{"$error":"#N/A"}},{"$f":"'SP64'!F86","v":0},{"$f":"'SP64'!G86","v":0},{"$f":"'SP64'!H86","v":0},{"$f":"'SP64'!I86","v":0},{"$f":"'SP64'!J86","v":0},{"$f":"'SP64'!K86","v":0},{"$f":"'SP64'!L86","v":0},{"$f":"'SP64'!AS86","v":"00:00:00"},{"$f":"'SP64'!AT86","v":"00:00:00"}]
["VR3",{"$f":"'SP64'!C87","v":85},{"$f":"IF(('SP64'!D87)=\"Freilos\",0,VLOOKUP('SP64'!D87,'BA-Teilnehmer'!$G$6:$J$69,4,FALSE))","v":{"$error":"#N/A"}},{"$f":"IF(('SP64'!E87)=\"Freilos\",0,VLOOKUP('SP64'!E87,'BA-Teilnehmer'!$G$6:$J$69,4,FALSE))","v":{"$error":"#N/A"}},{"$f":"'SP64'!F87","v":0},{"$f":"'SP64'!G87","v":0},{"$f":"'SP64'!H87","v":0},{"$f":"'SP64'!I87","v":0},{"$f":"'SP64'!J87","v":0},{"$f":"'SP64'!K87","v":0},{"$f":"'SP64'!L87","v":0},{"$f":"'SP64'!AS87","v":"00:00:00"},{"$f":"'SP64'!AT87","v":"00:00:00"}]
["VR3",{"$f":"'SP64'!C88","v":86},{"$f":"IF(('SP64'!D88)=\"Freilos\",0,VLOOKUP('SP64'!D88,'BA-Teilnehmer'!$G$6:$J$69,4,FALSE))","v":{"$error":"#N/A"}},{"$f":"IF(('SP64'!E88)=\"Freilos\",0,VLOOKUP('SP64'!E88,'BA-Teilnehmer'!$G$6:$J$69,4,FALSE))","v":{"$error":"#N/A"}},{"$f":"'SP64'!F88","v":0},{"$f":"'SP64'!G88","v":0},{"$f":"'SP64'!H88","v":0},{"$f":"'SP64'!I88","v":0},{"$f":"'SP64'!J88","v":0},{"$f":"'SP64'!K88","v":0},{"$f":"'SP64'!L88","v":0},{"$f":"'SP64'!AS88","v":"00:00:00"},{"$f":"'SP64'!AT88","v":"00:00:00"}]
["VR3",{"$f":"'SP64'!C89","v":87},{"$f":"IF(('SP64'!D89)=\"Freilos\",0,VLOOKUP('SP64'!D89,'BA-Teilnehmer'!$G$6:$J$69,4,FALSE))","v":{"$error":"#N/A"}},{"$f":"IF(('SP64'!E89)=\"Freilos\",0,VLOOKUP('SP64'!E89,'BA-Teilnehmer'!$G$6:$J$69,4,FALSE))","v":{"$error":"#N/A"}},{"$f":"'SP64'!F89","v":0},{"$f":"'SP64'!G89","v":0},{"$f":"'SP64'!H89","v":0},{"$f":"'SP64'!I89","v":0},{"$f":"'SP64'!J89","v":0},{"$f":"'SP64'!K89","v":0},{"$f":"'SP64'!L89","v":0},{"$f":"'SP64'!AS89","v":"00:00:00"},{"$f":"'SP64'!AT89","v":"00:00:00"}]
["VR3",{"$f":"'SP64'!C90","v":88},{"$f":"IF(('SP64'!D90)=\"Freilos\",0,VLOOKUP('SP64'!D90,'BA-Teilnehmer'!$G$6:$J$69,4,FALSE))","v":{"$error":"#N/A"}},{"$f":"IF(('SP64'!E90)=\"Freilos\",0,VLOOKUP('SP64'!E90,'BA-Teilnehmer'!$G$6:$J$69,4,FALSE))","v":{"$error":"#N/A"}},{"$f":"'SP64'!F90","v":0},{"$f":"'SP64'!G90","v":0},{"$f":"'SP64'!H90","v":0},{"$f":"'SP64'!I90","v":0},{"$f":"'SP64'!J90","v":0},{"$f":"'SP64'!K90","v":0},{"$f":"'SP64'!L90","v":0},{"$f":"'SP64'!AS90","v":"00:00:00"},{"$f":"'SP64'!AT90","v":"00:00:00"}]
[{"$f":"'SP64'!B91","v":"GR2"},{"$f":"'SP64'!C91","v":89},{"$f":"IF(('SP64'!D91)=\"Freilos\",0,VLOOKUP('SP64'!D91,'BA-Teilnehmer'!$G$6:$J$69,4,FALSE))","v":{"$error":"#N/A"}},{"$f":"IF(('SP64'!E91)=\"Freilos\",0,VLOOKUP('SP64'!E91,'BA-Teilnehmer'!$G$6:$J$69,4,FALSE))","v":{"$error":"#N/A"}},{"$f":"'SP64'!F91","v":0},{"$f":"'SP64'!G91","v":0},{"$f":"'SP64'!H91","v":0},{"$f":"'SP64'!I91","v":0},{"$f":"'SP64'!J91","v":0},{"$f":"'SP64'!K91","v":0},{"$f":"'SP64'!L91","v":0},{"$f":"'SP64'!AS91","v":"00:00:00"},{"$f":"'SP64'!AT91","v":"00:00:00"}]
[{"$f":"$A$89","v":"GR2"},{"$f":"'SP64'!C92","v":90},{"$f":"IF(('SP64'!D92)=\"Freilos\",0,VLOOKUP('SP64'!D92,'BA-Teilnehmer'!$G$6:$J$69,4,FALSE))","v":{"$error":"#N/A"}},{"$f":"IF(('SP64'!E92)=\"Freilos\",0,VLOOKUP('SP64'!E92,'BA-Teilnehmer'!$G$6:$J$69,4,FALSE))","v":{"$error":"#N/A"}},{"$f":"'SP64'!F92","v":0},{"$f":"'SP64'!G92","v":0},{"$f":"'SP64'!H92","v":0},{"$f":"'SP64'!I92","v":0},{"$f":"'SP64'!J92","v":0},{"$f":"'SP64'!K92","v":0},{"$f":"'SP64'!L92","v":0},{"$f":"'SP64'!AS92","v":"00:00:00"},{"$f":"'SP64'!AT92","v":"00:00:00"}]
[{"$f":"$A$89","v":"GR2"},{"$f":"'SP64'!C93","v":91},{"$f":"IF(('SP64'!D93)=\"Freilos\",0,VLOOKUP('SP64'!D93,'BA-Teilnehmer'!$G$6:$J$69,4,FALSE))","v":{"$error":"#N/A"}},{"$f":"IF(('SP64'!E93)=\"Freilos\",0,VLOOKUP('SP64'!E93,'BA-Teilnehmer'!$G$6:$J$69,4,FALSE))","v":{"$error":"#N/A"}},{"$f":"'SP64'!F93","v":0},{"$f":"'SP64'!G93","v":0},{"$f":"'SP64'!H93","v":0},{"$f":"'SP64'!I93","v":0},{"$f":"'SP64'!J93","v":0},{"$f":"'SP64'!K93","v":0},{"$f":"'SP64'!L93","v":0},{"$f":"'SP64'!AS93","v":"00:00:00"},{"$f":"'SP64'!AT93","v":"00:00:00"}]
["GR2",{"$f":"'SP64'!C94","v":92},{"$f":"IF(('SP64'!D94)=\"Freilos\",0,VLOOKUP('SP64'!D94,'BA-Teilnehmer'!$G$6:$J$69,4,FALSE))","v":{"$error":"#N/A"}},{"$f":"IF(('SP64'!E94)=\"Freilos\",0,VLOOKUP('SP64'!E94,'BA-Teilnehmer'!$G$6:$J$69,4,FALSE))","v":{"$error":"#N/A"}},{"$f":"'SP64'!F94","v":0},{"$f":"'SP64'!G94","v":0},{"$f":"'SP64'!H94","v":0},{"$f":"'SP64'!I94","v":0},{"$f":"'SP64'!J94","v":0},{"$f":"'SP64'!K94","v":0},{"$f":"'SP64'!L94","v":0},{"$f":"'SP64'!AS94","v":"00:00:00"},{"$f":"'SP64'!AT94","v":"00:00:00"}]
["GR2",{"$f":"'SP64'!C95","v":93},{"$f":"IF(('SP64'!D95)=\"Freilos\",0,VLOOKUP('SP64'!D95,'BA-Teilnehmer'!$G$6:$J$69,4,FALSE))","v":{"$error":"#N/A"}},{"$f":"IF(('SP64'!E95)=\"Freilos\",0,VLOOKUP('SP64'!E95,'BA-Teilnehmer'!$G$6:$J$69,4,FALSE))","v":{"$error":"#N/A"}},{"$f":"'SP64'!F95","v":0},{"$f":"'SP64'!G95","v":0},{"$f":"'SP64'!H95","v":0},{"$f":"'SP64'!I95","v":0},{"$f":"'SP64'!J95","v":0},{"$f":"'SP64'!K95","v":0},{"$f":"'SP64'!L95","v":0},{"$f":"'SP64'!AS95","v":"00:00:00"},{"$f":"'SP64'!AT95","v":"00:00:00"}]
["GR2",{"$f":"'SP64'!C96","v":94},{"$f":"IF(('SP64'!D96)=\"Freilos\",0,VLOOKUP('SP64'!D96,'BA-Teilnehmer'!$G$6:$J$69,4,FALSE))","v":{"$error":"#N/A"}},{"$f":"IF(('SP64'!E96)=\"Freilos\",0,VLOOKUP('SP64'!E96,'BA-Teilnehmer'!$G$6:$J$69,4,FALSE))","v":{"$error":"#N/A"}},{"$f":"'SP64'!F96","v":0},{"$f":"'SP64'!G96","v":0},{"$f":"'SP64'!H96","v":0},{"$f":"'SP64'!I96","v":0},{"$f":"'SP64'!J96","v":0},{"$f":"'SP64'!K96","v":0},{"$f":"'SP64'!L96","v":0},{"$f":"'SP64'!AS96","v":"00:00:00"},{"$f":"'SP64'!AT96","v":"00:00:00"}]
["GR2",{"$f":"'SP64'!C97","v":95},{"$f":"IF(('SP64'!D97)=\"Freilos\",0,VLOOKUP('SP64'!D97,'BA-Teilnehmer'!$G$6:$J$69,4,FALSE))","v":{"$error":"#N/A"}},{"$f":"IF(('SP64'!E97)=\"Freilos\",0,VLOOKUP('SP64'!E97,'BA-Teilnehmer'!$G$6:$J$69,4,FALSE))","v":{"$error":"#N/A"}},{"$f":"'SP64'!F97","v":0},{"$f":"'SP64'!G97","v":0},{"$f":"'SP64'!H97","v":0},{"$f":"'SP64'!I97","v":0},{"$f":"'SP64'!J97","v":0},{"$f":"'SP64'!K97","v":0},{"$f":"'SP64'!L97","v":0},{"$f":"'SP64'!AS97","v":"00:00:00"},{"$f":"'SP64'!AT97","v":"00:00:00"}]
["GR2",{"$f":"'SP64'!C98","v":96},{"$f":"IF(('SP64'!D98)=\"Freilos\",0,VLOOKUP('SP64'!D98,'BA-Teilnehmer'!$G$6:$J$69,4,FALSE))","v":{"$error":"#N/A"}},{"$f":"IF(('SP64'!E98)=\"Freilos\",0,VLOOKUP('SP64'!E98,'BA-Teilnehmer'!$G$6:$J$69,4,FALSE))","v":{"$error":"#N/A"}},{"$f":"'SP64'!F98","v":0},{"$f":"'SP64'!G98","v":0},{"$f":"'SP64'!H98","v":0},{"$f":"'SP64'!I98","v":0},{"$f":"'SP64'!J98","v":0},{"$f":"'SP64'!K98","v":0},{"$f":"'SP64'!L98","v":0},{"$f":"'SP64'!AS98","v":"00:00:00"},{"$f":"'SP64'!AT98","v":"00:00:00"}]
[{"$f":"'SP64'!B99","v":"VR4"},{"$f":"'SP64'!C99","v":97},{"$f":"IF(('SP64'!D99)=\"Freilos\",0,VLOOKUP('SP64'!D99,'BA-Teilnehmer'!$G$6:$J$69,4,FALSE))","v":{"$error":"#N/A"}},{"$f":"IF(('SP64'!E99)=\"Freilos\",0,VLOOKUP('SP64'!E99,'BA-Teilnehmer'!$G$6:$J$69,4,FALSE))","v":{"$error":"#N/A"}},{"$f":"'SP64'!F99","v":0},{"$f":"'SP64'!G99","v":0},{"$f":"'SP64'!H99","v":0},{"$f":"'SP64'!I99","v":0},{"$f":"'SP64'!J99","v":0},{"$f":"'SP64'!K99","v":0},{"$f":"'SP64'!L99","v":0},{"$f":"'SP64'!AS99","v":"00:00:00"},{"$f":"'SP64'!AT99","v":"00:00:00"}]
[{"$f":"$A$97","v":"VR4"},{"$f":"'SP64'!C100","v":98},{"$f":"IF(('SP64'!D100)=\"Freilos\",0,VLOOKUP('SP64'!D100,'BA-Teilnehmer'!$G$6:$J$69,4,FALSE))","v":{"$error":"#N/A"}},{"$f":"IF(('SP64'!E100)=\"Freilos\",0,VLOOKUP('SP64'!E100,'BA-Teilnehmer'!$G$6:$J$69,4,FALSE))","v":{"$error":"#N/A"}},{"$f":"'SP64'!F100","v":0},{"$f":"'SP64'!G100","v":0},{"$f":"'SP64'!H100","v":0},{"$f":"'SP64'!I100","v":0},{"$f":"'SP64'!J100","v":0},{"$f":"'SP64'!K100","v":0},{"$f":"'SP64'!L100","v":0},{"$f":"'SP64'!AS100","v":"00:00:00"},{"$f":"'SP64'!AT100","v":"00:00:00"}]
[{"$f":"$A$97","v":"VR4"},{"$f":"'SP64'!C101","v":99},{"$f":"IF(('SP64'!D101)=\"Freilos\",0,VLOOKUP('SP64'!D101,'BA-Teilnehmer'!$G$6:$J$69,4,FALSE))","v":{"$error":"#N/A"}},{"$f":"IF(('SP64'!E101)=\"Freilos\",0,VLOOKUP('SP64'!E101,'BA-Teilnehmer'!$G$6:$J$69,4,FALSE))","v":{"$error":"#N/A"}},{"$f":"'SP64'!F101","v":0},{"$f":"'SP64'!G101","v":0},{"$f":"'SP64'!H101","v":0},{"$f":"'SP64'!I101","v":0},{"$f":"'SP64'!J101","v":0},{"$f":"'SP64'!K101","v":0},{"$f":"'SP64'!L101","v":0},{"$f":"'SP64'!AS101","v":"00:00:00"},{"$f":"'SP64'!AT101","v":"00:00:00"}]
["VR4",{"$f":"'SP64'!C102","v":100},{"$f":"IF(('SP64'!D102)=\"Freilos\",0,VLOOKUP('SP64'!D102,'BA-Teilnehmer'!$G$6:$J$69,4,FALSE))","v":{"$error":"#N/A"}},{"$f":"IF(('SP64'!E102)=\"Freilos\",0,VLOOKUP('SP64'!E102,'BA-Teilnehmer'!$G$6:$J$69,4,FALSE))","v":{"$error":"#N/A"}},{"$f":"'SP64'!F102","v":0},{"$f":"'SP64'!G102","v":0},{"$f":"'SP64'!H102","v":0},{"$f":"'SP64'!I102","v":0},{"$f":"'SP64'!J102","v":0},{"$f":"'SP64'!K102","v":0},{"$f":"'SP64'!L102","v":0},{"$f":"'SP64'!AS102","v":"00:00:00"},{"$f":"'SP64'!AT102","v":"00:00:00"}]
["VR4",{"$f":"'SP64'!C103","v":101},{"$f":"IF(('SP64'!D103)=\"Freilos\",0,VLOOKUP('SP64'!D103,'BA-Teilnehmer'!$G$6:$J$69,4,FALSE))","v":{"$error":"#N/A"}},{"$f":"IF(('SP64'!E103)=\"Freilos\",0,VLOOKUP('SP64'!E103,'BA-Teilnehmer'!$G$6:$J$69,4,FALSE))","v":{"$error":"#N/A"}},{"$f":"'SP64'!F103","v":0},{"$f":"'SP64'!G103","v":0},{"$f":"'SP64'!H103","v":0},{"$f":"'SP64'!I103","v":0},{"$f":"'SP64'!J103","v":0},{"$f":"'SP64'!K103","v":0},{"$f":"'SP64'!L103","v":0},{"$f":"'SP64'!AS103","v":"00:00:00"},{"$f":"'SP64'!AT103","v":"00:00:00"}]
["VR4",{"$f":"'SP64'!C104","v":102},{"$f":"IF(('SP64'!D104)=\"Freilos\",0,VLOOKUP('SP64'!D104,'BA-Teilnehmer'!$G$6:$J$69,4,FALSE))","v":{"$error":"#N/A"}},{"$f":"IF(('SP64'!E104)=\"Freilos\",0,VLOOKUP('SP64'!E104,'BA-Teilnehmer'!$G$6:$J$69,4,FALSE))","v":{"$error":"#N/A"}},{"$f":"'SP64'!F104","v":0},{"$f":"'SP64'!G104","v":0},{"$f":"'SP64'!H104","v":0},{"$f":"'SP64'!I104","v":0},{"$f":"'SP64'!J104","v":0},{"$f":"'SP64'!K104","v":0},{"$f":"'SP64'!L104","v":0},{"$f":"'SP64'!AS104","v":"00:00:00"},{"$f":"'SP64'!AT104","v":"00:00:00"}]
["VR4",{"$f":"'SP64'!C105","v":103},{"$f":"IF(('SP64'!D105)=\"Freilos\",0,VLOOKUP('SP64'!D105,'BA-Teilnehmer'!$G$6:$J$69,4,FALSE))","v":{"$error":"#N/A"}},{"$f":"IF(('SP64'!E105)=\"Freilos\",0,VLOOKUP('SP64'!E105,'BA-Teilnehmer'!$G$6:$J$69,4,FALSE))","v":{"$error":"#N/A"}},{"$f":"'SP64'!F105","v":0},{"$f":"'SP64'!G105","v":0},{"$f":"'SP64'!H105","v":0},{"$f":"'SP64'!I105","v":0},{"$f":"'SP64'!J105","v":0},{"$f":"'SP64'!K105","v":0},{"$f":"'SP64'!L105","v":0},{"$f":"'SP64'!AS105","v":"00:00:00"},{"$f":"'SP64'!AT105","v":"00:00:00"}]
["VR4",{"$f":"'SP64'!C106","v":104},{"$f":"IF(('SP64'!D106)=\"Freilos\",0,VLOOKUP('SP64'!D106,'BA-Teilnehmer'!$G$6:$J$69,4,FALSE))","v":{"$error":"#N/A"}},{"$f":"IF(('SP64'!E106)=\"Freilos\",0,VLOOKUP('SP64'!E106,'BA-Teilnehmer'!$G$6:$J$69,4,FALSE))","v":{"$error":"#N/A"}},{"$f":"'SP64'!F106","v":0},{"$f":"'SP64'!G106","v":0},{"$f":"'SP64'!H106","v":0},{"$f":"'SP64'!I106","v":0},{"$f":"'SP64'!J106","v":0},{"$f":"'SP64'!K106","v":0},{"$f":"'SP64'!L106","v":0},{"$f":"'SP64'!AS106","v":"00:00:00"},{"$f":"'SP64'!AT106","v":"00:00:00"}]
[{"$f":"'SP64'!B107","v":"VR5"},{"$f":"'SP64'!C107","v":105},{"$f":"IF(('SP64'!D107)=\"Freilos\",0,VLOOKUP('SP64'!D107,'BA-Teilnehmer'!$G$6:$J$69,4,FALSE))","v":{"$error":"#N/A"}},{"$f":"IF(('SP64'!E107)=\"Freilos\",0,VLOOKUP('SP64'!E107,'BA-Teilnehmer'!$G$6:$J$69,4,FALSE))","v":{"$error":"#N/A"}},{"$f":"'SP64'!F107","v":0},{"$f":"'SP64'!G107","v":0},{"$f":"'SP64'!H107","v":0},{"$f":"'SP64'!I107","v":0},{"$f":"'SP64'!J107","v":0},{"$f":"'SP64'!K107","v":0},{"$f":"'SP64'!L107","v":0},{"$f":"'SP64'!AS107","v":"00:00:00"},{"$f":"'SP64'!AT107","v":"00:00:00"}]
[{"$f":"$A$105","v":"VR5"},{"$f":"'SP64'!C108","v":106},{"$f":"IF(('SP64'!D108)=\"Freilos\",0,VLOOKUP('SP64'!D108,'BA-Teilnehmer'!$G$6:$J$69,4,FALSE))","v":{"$error":"#N/A"}},{"$f":"IF(('SP64'!E108)=\"Freilos\",0,VLOOKUP('SP64'!E108,'BA-Teilnehmer'!$G$6:$J$69,4,FALSE))","v":{"$error":"#N/A"}},{"$f":"'SP64'!F108","v":0},{"$f":"'SP64'!G108","v":0},{"$f":"'SP64'!H108","v":0},{"$f":"'SP64'!I108","v":0},{"$f":"'SP64'!J108","v":0},{"$f":"'SP64'!K108","v":0},{"$f":"'SP64'!L108","v":0},{"$f":"'SP64'!AS108","v":"00:00:00"},{"$f":"'SP64'!AT108","v":"00:00:00"}]
[{"$f":"$A$105","v":"VR5"},{"$f":"'SP64'!C109","v":107},{"$f":"IF(('SP64'!D109)=\"Freilos\",0,VLOOKUP('SP64'!D109,'BA-Teilnehmer'!$G$6:$J$69,4,FALSE))","v":{"$error":"#N/A"}},{"$f":"IF(('SP64'!E109)=\"Freilos\",0,VLOOKUP('SP64'!E109,'BA-Teilnehmer'!$G$6:$J$69,4,FALSE))","v":{"$error":"#N/A"}},{"$f":"'SP64'!F109","v":0},{"$f":"'SP64'!G109","v":0},{"$f":"'SP64'!H109","v":0},{"$f":"'SP64'!I109","v":0},{"$f":"'SP64'!J109","v":0},{"$f":"'SP64'!K109","v":0},{"$f":"'SP64'!L109","v":0},{"$f":"'SP64'!AS109","v":"00:00:00"},{"$f":"'SP64'!AT109","v":"00:00:00"}]
[{"$f":"$A$105","v":"VR5"},{"$f":"'SP64'!C110","v":108},{"$f":"IF(('SP64'!D110)=\"Freilos\",0,VLOOKUP('SP64'!D110,'BA-Teilnehmer'!$G$6:$J$69,4,FALSE))","v":{"$error":"#N/A"}},{"$f":"IF(('SP64'!E110)=\"Freilos\",0,VLOOKUP('SP64'!E110,'BA-Teilnehmer'!$G$6:$J$69,4,FALSE))","v":{"$error":"#N/A"}},{"$f":"'SP64'!F110","v":0},{"$f":"'SP64'!G110","v":0},{"$f":"'SP64'!H110","v":0},{"$f":"'SP64'!I110","v":0},{"$f":"'SP64'!J110","v":0},{"$f":"'SP64'!K110","v":0},{"$f":"'SP64'!L110","v":0},{"$f":"'SP64'!AS110","v":"00:00:00"},{"$f":"'SP64'!AT110","v":"00:00:00"}]
[{"$f":"'SP64'!B111","v":"GR3"},{"$f":"'SP64'!C111","v":109},{"$f":"IF(('SP64'!D111)=\"Freilos\",0,VLOOKUP('SP64'!D111,'BA-Teilnehmer'!$G$6:$J$69,4,FALSE))","v":{"$error":"#N/A"}},{"$f":"IF(('SP64'!E111)=\"Freilos\",0,VLOOKUP('SP64'!E111,'BA-Teilnehmer'!$G$6:$J$69,4,FALSE))","v":{"$error":"#N/A"}},{"$f":"'SP64'!F111","v":0},{"$f":"'SP64'!G111","v":0},{"$f":"'SP64'!H111","v":0},{"$f":"'SP64'!I111","v":0},{"$f":"'SP64'!J111","v":0},{"$f":"'SP64'!K111","v":0},{"$f":"'SP64'!L111","v":0},{"$f":"'SP64'!AS111","v":"00:00:00"},{"$f":"'SP64'!AT111","v":"00:00:00"}]
[{"$f":"$A$109","v":"GR3"},{"$f":"'SP64'!C112","v":110},{"$f":"IF(('SP64'!D112)=\"Freilos\",0,VLOOKUP('SP64'!D112,'BA-Teilnehmer'!$G$6:$J$69,4,FALSE))","v":{"$error":"#N/A"}},{"$f":"IF(('SP64'!E112)=\"Freilos\",0,VLOOKUP('SP64'!E112,'BA-Teilnehmer'!$G$6:$J$69,4,FALSE))","v":{"$error":"#N/A"}},{"$f":"'SP64'!F112","v":0},{"$f":"'SP64'!G112","v":0},{"$f":"'SP64'!H112","v":0},{"$f":"'SP64'!I112","v":0},{"$f":"'SP64'!J112","v":0},{"$f":"'SP64'!K112","v":0},{"$f":"'SP64'!L112","v":0},{"$f":"'SP64'!AS112","v":"00:00:00"},{"$f":"'SP64'!AT112","v":"00:00:00"}]
[{"$f":"$A$109","v":"GR3"},{"$f":"'SP64'!C113","v":111},{"$f":"IF(('SP64'!D113)=\"Freilos\",0,VLOOKUP('SP64'!D113,'BA-Teilnehmer'!$G$6:$J$69,4,FALSE))","v":{"$error":"#N/A"}},{"$f":"IF(('SP64'!E113)=\"Freilos\",0,VLOOKUP('SP64'!E113,'BA-Teilnehmer'!$G$6:$J$69,4,FALSE))","v":{"$error":"#N/A"}},{"$f":"'SP64'!F113","v":0},{"$f":"'SP64'!G113","v":0},{"$f":"'SP64'!H113","v":0},{"$f":"'SP64'!I113","v":0},{"$f":"'SP64'!J113","v":0},{"$f":"'SP64'!K113","v":0},{"$f":"'SP64'!L113","v":0},{"$f":"'SP64'!AS113","v":"00:00:00"},{"$f":"'SP64'!AT113","v":"00:00:00"}]
[{"$f":"$A$109","v":"GR3"},{"$f":"'SP64'!C114","v":112},{"$f":"IF(('SP64'!D114)=\"Freilos\",0,VLOOKUP('SP64'!D114,'BA-Teilnehmer'!$G$6:$J$69,4,FALSE))","v":{"$error":"#N/A"}},{"$f":"IF(('SP64'!E114)=\"Freilos\",0,VLOOKUP('SP64'!E114,'BA-Teilnehmer'!$G$6:$J$69,4,FALSE))","v":{"$error":"#N/A"}},{"$f":"'SP64'!F114","v":0},{"$f":"'SP64'!G114","v":0},{"$f":"'SP64'!H114","v":0},{"$f":"'SP64'!I114","v":0},{"$f":"'SP64'!J114","v":0},{"$f":"'SP64'!K114","v":0},{"$f":"'SP64'!L114","v":0},{"$f":"'SP64'!AS114","v":"00:00:00"},{"$f":"'SP64'!AT114","v":"00:00:00"}]
[{"$f":"'SP64'!B115","v":"VR6"},{"$f":"'SP64'!C115","v":113},{"$f":"IF(('SP64'!D115)=\"Freilos\",0,VLOOKUP('SP64'!D115,'BA-Teilnehmer'!$G$6:$J$69,4,FALSE))","v":{"$error":"#N/A"}},{"$f":"IF(('SP64'!E115)=\"Freilos\",0,VLOOKUP('SP64'!E115,'BA-Teilnehmer'!$G$6:$J$69,4,FALSE))","v":{"$error":"#N/A"}},{"$f":"'SP64'!F115","v":0},{"$f":"'SP64'!G115","v":0},{"$f":"'SP64'!H115","v":0},{"$f":"'SP64'!I115","v":0},{"$f":"'SP64'!J115","v":0},{"$f":"'SP64'!K115","v":0},{"$f":"'SP64'!L115","v":0},{"$f":"'SP64'!AS115","v":"00:00:00"},{"$f":"'SP64'!AT115","v":"00:00:00"}]
[{"$f":"$A$113","v":"VR6"},{"$f":"'SP64'!C116","v":114},{"$f":"IF(('SP64'!D116)=\"Freilos\",0,VLOOKUP('SP64'!D116,'BA-Teilnehmer'!$G$6:$J$69,4,FALSE))","v":{"$error":"#N/A"}},{"$f":"IF(('SP64'!E116)=\"Freilos\",0,VLOOKUP('SP64'!E116,'BA-Teilnehmer'!$G$6:$J$69,4,FALSE))","v":{"$error":"#N/A"}},{"$f":"'SP64'!F116","v":0},{"$f":"'SP64'!G116","v":0},{"$f":"'SP64'!H116","v":0},{"$f":"'SP64'!I116","v":0},{"$f":"'SP64'!J116","v":0},{"$f":"'SP64'!K116","v":0},{"$f":"'SP64'!L116","v":0},{"$f":"'SP64'!AS116","v":"00:00:00"},{"$f":"'SP64'!AT116","v":"00:00:00"}]
[{"$f":"$A$113","v":"VR6"},{"$f":"'SP64'!C117","v":115},{"$f":"IF(('SP64'!D117)=\"Freilos\",0,VLOOKUP('SP64'!D117,'BA-Teilnehmer'!$G$6:$J$69,4,FALSE))","v":{"$error":"#N/A"}},{"$f":"IF(('SP64'!E117)=\"Freilos\",0,VLOOKUP('SP64'!E117,'BA-Teilnehmer'!$G$6:$J$69,4,FALSE))","v":{"$error":"#N/A"}},{"$f":"'SP64'!F117","v":0},{"$f":"'SP64'!G117","v":0},{"$f":"'SP64'!H117","v":0},{"$f":"'SP64'!I117","v":0},{"$f":"'SP64'!J117","v":0},{"$f":"'SP64'!K117","v":0},{"$f":"'SP64'!L117","v":0},{"$f":"'SP64'!AS117","v":"00:00:00"},{"$f":"'SP64'!AT117","v":"00:00:00"}]
[{"$f":"$A$113","v":"VR6"},{"$f":"'SP64'!C118","v":116},{"$f":"IF(('SP64'!D118)=\"Freilos\",0,VLOOKUP('SP64'!D118,'BA-Teilnehmer'!$G$6:$J$69,4,FALSE))","v":{"$error":"#N/A"}},{"$f":"IF(('SP64'!E118)=\"Freilos\",0,VLOOKUP('SP64'!E118,'BA-Teilnehmer'!$G$6:$J$69,4,FALSE))","v":{"$error":"#N/A"}},{"$f":"'SP64'!F118","v":0},{"$f":"'SP64'!G118","v":0},{"$f":"'SP64'!H118","v":0},{"$f":"'SP64'!I118","v":0},{"$f":"'SP64'!J118","v":0},{"$f":"'SP64'!K118","v":0},{"$f":"'SP64'!L118","v":0},{"$f":"'SP64'!AS118","v":"00:00:00"},{"$f":"'SP64'!AT118","v":"00:00:00"}]
["1/4 Fin",{"$f":"'SP64'!C119","v":117},{"$f":"IF((Viertelfinale!C11)=\"Freilos\",0,VLOOKUP(Viertelfinale!C11,'BA-Teilnehmer'!$G$6:$J$69,4,FALSE))","v":{"$error":"#N/A"}},{"$f":"IF((Viertelfinale!D11)=\"Freilos\",0,VLOOKUP(Viertelfinale!D11,'BA-Teilnehmer'!$G$6:$J$69,4,FALSE))","v":{"$error":"#N/A"}},{"$f":"Viertelfinale!E11","v":0},{"$f":"Viertelfinale!F11","v":0},{"$f":"'SP64'!H119","v":0},{"$f":"'SP64'!I119","v":0},{"$f":"'SP64'!J119","v":0},{"$f":"'SP64'!K119","v":0},{"$f":"'SP64'!L119","v":0},{"$f":"'SP64'!AS119","v":"00:00:00"},{"$f":"'SP64'!AT119","v":"00:00:00"}]
["1/4 Fin",{"$f":"'SP64'!C120","v":118},{"$f":"IF((Viertelfinale!C12)=\"Freilos\",0,VLOOKUP(Viertelfinale!C12,'BA-Teilnehmer'!$G$6:$J$69,4,FALSE))","v":{"$error":"#N/A"}},{"$f":"IF((Viertelfinale!D12)=\"Freilos\",0,VLOOKUP(Viertelfinale!D12,'BA-Teilnehmer'!$G$6:$J$69,4,FALSE))","v":{"$error":"#N/A"}},{"$f":"Viertelfinale!E12","v":0},{"$f":"Viertelfinale!F12","v":0},{"$f":"'SP64'!H120","v":0},{"$f":"'SP64'!I120","v":0},{"$f":"'SP64'!J120","v":0},{"$f":"'SP64'!K120","v":0},{"$f":"'SP64'!L120","v":0},{"$f":"'SP64'!AS120","v":"00:00:00"},{"$f":"'SP64'!AT120","v":"00:00:00"}]
["1/4 Fin",{"$f":"'SP64'!C121","v":119},{"$f":"IF((Viertelfinale!C13)=\"Freilos\",0,VLOOKUP(Viertelfinale!C13,'BA-Teilnehmer'!$G$6:$J$69,4,FALSE))","v":{"$error":"#N/A"}},{"$f":"IF((Viertelfinale!D13)=\"Freilos\",0,VLOOKUP(Viertelfinale!D13,'BA-Teilnehmer'!$G$6:$J$69,4,FALSE))","v":{"$error":"#N/A"}},{"$f":"Viertelfinale!E13","v":0},{"$f":"Viertelfinale!F13","v":0},{"$f":"'SP64'!H121","v":0},{"$f":"'SP64'!I121","v":0},{"$f":"'SP64'!J121","v":0},{"$f":"'SP64'!K121","v":0},{"$f":"'SP64'!L121","v":0},{"$f":"'SP64'!AS121","v":"00:00:00"},{"$f":"'SP64'!AT121","v":"00:00:00"}]
["1/4 Fin",{"$f":"'SP64'!C122","v":120},{"$f":"IF((Viertelfinale!C14)=\"Freilos\",0,VLOOKUP(Viertelfinale!C14,'BA-Teilnehmer'!$G$6:$J$69,4,FALSE))","v":{"$error":"#N/A"}},{"$f":"IF((Viertelfinale!D14)=\"Freilos\",0,VLOOKUP(Viertelfinale!D14,'BA-Teilnehmer'!$G$6:$J$69,4,FALSE))","v":{"$error":"#N/A"}},{"$f":"Viertelfinale!E14","v":0},{"$f":"Viertelfinale!F14","v":0},{"$f":"'SP64'!H122","v":0},{"$f":"'SP64'!I122","v":0},{"$f":"'SP64'!J122","v":0},{"$f":"'SP64'!K122","v":0},{"$f":"'SP64'!L122","v":0},{"$f":"'SP64'!AS122","v":"00:00:00"},{"$f":"'SP64'!AT122","v":"00:00:00"}]
["1/2 Fin",{"$f":"'SP64'!C123","v":121},{"$f":"IF((Viertelfinale!C18)=\"Freilos\",0,VLOOKUP(Viertelfinale!C18,'BA-Teilnehmer'!$G$6:$J$69,4,FALSE))","v":{"$error":"#N/A"}},{"$f":"IF((Viertelfinale!D18)=\"Freilos\",0,VLOOKUP(Viertelfinale!D18,'BA-Teilnehmer'!$G$6:$J$69,4,FALSE))","v":{"$error":"#N/A"}},{"$f":"Viertelfinale!E18","v":0},{"$f":"Viertelfinale!F18","v":0},{"$f":"'SP64'!H123","v":0},{"$f":"'SP64'!I123","v":0},{"$f":"'SP64'!J123","v":0},{"$f":"'SP64'!K123","v":0},{"$f":"'SP64'!L123","v":0},{"$f":"'SP64'!AS123","v":"00:00:00"},{"$f":"'SP64'!AT123","v":"00:00:00"}]
["1/2 Fin",{"$f":"'SP64'!C124","v":122},{"$f":"IF((Viertelfinale!C19)=\"Freilos\",0,VLOOKUP(Viertelfinale!C19,'BA-Teilnehmer'!$G$6:$J$69,4,FALSE))","v":{"$error":"#N/A"}},{"$f":"IF((Viertelfinale!D19)=\"Freilos\",0,VLOOKUP(Viertelfinale!D19,'BA-Teilnehmer'!$G$6:$J$69,4,FALSE))","v":{"$error":"#N/A"}},{"$f":"Viertelfinale!E19","v":0},{"$f":"Viertelfinale!F19","v":0},{"$f":"'SP64'!H124","v":0},{"$f":"'SP64'!I124","v":0},{"$f":"'SP64'!J124","v":0},{"$f":"'SP64'!K124","v":0},{"$f":"'SP64'!L124","v":0},{"$f":"'SP64'!AS124","v":"00:00:00"},{"$f":"'SP64'!AT124","v":"00:00:00"}]
["Platz 3",{"$f":"'SP64'!C125","v":123},{"$f":"IF((Viertelfinale!C23)=\"Freilos\",0,VLOOKUP(Viertelfinale!C23,'BA-Teilnehmer'!$G$6:$J$69,4,FALSE))","v":{"$error":"#N/A"}},{"$f":"IF((Viertelfinale!D23)=\"Freilos\",0,VLOOKUP(Viertelfinale!D23,'BA-Teilnehmer'!$G$6:$J$69,4,FALSE))","v":{"$error":"#N/A"}},{"$f":"Viertelfinale!E23","v":0},{"$f":"Viertelfinale!F23","v":0},{"$f":"'SP64'!H125","v":0},{"$f":"'SP64'!I125","v":0},{"$f":"'SP64'!J125","v":0},{"$f":"'SP64'!K125","v":0},{"$f":"'SP64'!L125","v":0},{"$f":"'SP64'!AS125","v":"00:00:00"},{"$f":"'SP64'!AT125","v":"00:00:00"}]
["Finale",{"$f":"'SP64'!C126","v":124},{"$f":"IF((Viertelfinale!C27)=\"Freilos\",0,VLOOKUP(Viertelfinale!C27,'BA-Teilnehmer'!$G$6:$J$69,4,FALSE))","v":{"$error":"#N/A"}},{"$f":"IF((Viertelfinale!D27)=\"Freilos\",0,VLOOKUP(Viertelfinale!D27,'BA-Teilnehmer'!$G$6:$J$69,4,FALSE))","v":{"$error":"#N/A"}},{"$f":"Viertelfinale!E27","v":0},{"$f":"Viertelfinale!F27","v":0},{"$f":"'SP64'!H126","v":0},{"$f":"'SP64'!I126","v":0},{"$f":"'SP64'!J126","v":0},{"$f":"'SP64'!K126","v":0},{"$f":"'SP64'!L126","v":0},{"$f":"'SP64'!AS126","v":"00:00:00"},{"$f":"'SP64'!AT126","v":"00:00:00"}]

{"sheet":"Mitglieder","index":8,"n_rows":1632,"n_cols":5,"rows_kept":1632,"cut":false,"hidden":true,"merged":[]}
["Name Vorname","VNR","VNAME","MG_NR","RP"]
["Aigner, Michael",301,"Olimpia München",724,27]
["Al Faraj, Marcel",301,"Olimpia München",689,14]
["Alexus, Petras",301,"Olimpia München",709,""]
["Anzinger, Ronald",301,"Olimpia München",618,28]
["Auer, Dietmar-Lothar",301,"Olimpia München",690,29]
["Bachleitner, Heinz",301,"Olimpia München",691,""]
["Bauereiß, Rüdiger",301,"Olimpia München",564,30]
["Bekaj, Viktor",301,"Olimpia München",464,""]
["Biangini, Fritz",301,"Olimpia München",620,32]
["Biangini, Jacqueline",301,"Olimpia München",566,31]
["Bonde, Thomas",301,"Olimpia München",659,33]
["Botis, Cora",301,"Olimpia München",712,""]
["Burghofer, Matthias",301,"Olimpia München",421,34]
["Burkhart, Holger",301,"Olimpia München",192,17]
["Buschhüter, Sylvia",301,"Olimpia München",205,35]
["Carnovalini, Alberto",301,"Olimpia München",710,""]
["Cinku, Emel",301,"Olimpia München",719,37]
["Dimitriu, Panagiotis",301,"Olimpia München",382,19]
["Djuvic, Daniel",301,"Olimpia München",715,39]
["Eggendorfer, Peter",301,"Olimpia München",383,6]
["Ehlers, Nico",301,"Olimpia München",660,5]
["Elbing, Dennis",301,"Olimpia München",493,40]
["Englbrecht, Willi",301,"Olimpia München",2,41]
["Federmann, Markus",301,"Olimpia München",661,18]
["Feiler, Dieter",301,"Olimpia München",662,42]
["Fillenhals, Florian",301,"Olimpia München",683,43]
["Fischer, Andreas",301,"Olimpia München",693,""]
["Friedmann, Hermann",301,"Olimpia München",60,44]
["Fukuhara-Moser, Yoshie",301,"Olimpia München",569,45]
["Gacic, Dragan",301,"Olimpia München",494,46]
["Gehringer, Roman",301,"Olimpia München",713,48]
["Gerr, Benjamin",301,"Olimpia München",685,22]
["Gilik, Michael",301,"Olimpia München",98,3]
["Grill, Stefan",301,"Olimpia München",527,8]
["Gruber, Martin",301,"Olimpia München",695,50]
["Guth, Michael",301,"Olimpia München",570,13]
["Hasan, Kristijan",301,"Olimpia München",315,51]
["Haude, Torsten",301,"Olimpia München",663,1]
["Hauser, Florian",301,"Olimpia München",572,52]
["Hauser, Rolf",301,"Olimpia München",428,23]
["Hiermeier, Michael",301,"Olimpia München",529,""]
["Hilz, Peter",301,"Olimpia München",722,53]
["Hofberger, Josef",301,"Olimpia München",17,54]
["Hoffmann, Sascha",301,"Olimpia München",664,55]
["Holzmann, Julian",301,"Olimpia München",642,56]
["Hör, Carsten",301,"Olimpia München",665,58]
["Kahlenberg, Mark",301,"Olimpia München",669,59]
["Karadag, Handan-Hamide",301,"Olimpia München",696,26]
["Karadag, Mefayil",301,"Olimpia München",575,10]
["Kautz, Volker",301,"Olimpia München",80,""]
["Klara, Henri Pierre",301,"Olimpia München",537,62]
["Klügel, Thomas",301,"Olimpia München",539,7]
["Knoche, Konstantin",301,"Olimpia München",714,61]
["König, Wolfgang",301,"Olimpia München",697,63]
["Krasser, Andreas",301,"Olimpia München",501,11]
["Krebs, David",301,"Olimpia München",627,64]
["Kretschmann, Stefan",301,"Olimpia München",470,2]
["Kühn, Andreas",301,"Olimpia München",502,65]
["Lale, Ferhat",301,"Olimpia München",630,67]
["Lange, Daniela",301,"Olimpia München",728,15]
["Lange, Hendrik",301,"Olimpia München",730,16]
["Lange, Robert",301,"Olimpia München",729,66]
["Lechl, Günther",301,"Olimpia München",3,68]
["Lechner, Stefan",301,"Olimpia München",504,69]
["Lederle, Alois",301,"Olimpia München",12,70]
["Mader, Gregor",301,"Olimpia München",698,71]
["Masuth, Slobodan",301,"Olimpia München",699,""]
["Meimmerer, Benjamin",301,"Olimpia München",723,""]
["Mellinger, Hans-Peter",301,"Olimpia München",700,12]
["Mikulcic, Anton",301,"Olimpia München",701,21]
["Nusko, Mario",301,"Olimpia München",686,74]
["Papatheodorou, Joannis",301,"Olimpia München",720,75]
["Parcaoglu, Bülent",301,"Olimpia München",28,76]
["Reggiani, Simona",301,"Olimpia München",656,77]
["Ries, Matthias",301,"Olimpia München",401,25]
["Roth, Manuel",301,"Olimpia München",711,79]
["Rudolph, Daniel",301,"Olimpia München",705,""]
["Schettlinger, Torsten",301,"Olimpia München",706,81]
["Schlennert, Andreas",301,"Olimpia München",682,82]
["Schmidt, Johann",301,"Olimpia München",375,84]
["Schmidt, Josef",301,"Olimpia München",5,83]
["Schmidt, Ronnie",301,"Olimpia München",727,85]
["Schneider, Nicole",301,"Olimpia München",721,87]
["Schneider, Rudolf",301,"Olimpia München",6,24]
["Schwab, Jakob",301,"Olimpia München",511,88]
["Sendlbeck, Ludwig",301,"Olimpia München",707,90]
["Sittinger, Willibald",301,"Olimpia München",725,91]
["Smajkic, Muamer",301,"Olimpia München",679,9]
["Stangl-Perotto, Ralf",301,"Olimpia München",482,92]
["Stolka, Fabian",301,"Olimpia München",658,94]
["Thiel, Sascha",301,"Olimpia München",639,95]
["Thoms, Werner",301,"Olimpia München",617,96]
["Tso, Raymond",301,"Olimpia München",688,""]
["Vielhuber, Christian",301,"Olimpia München",717,""]
["Vincenzi, Gaetano",301,"Olimpia München",515,98]
["Vogel, Andre",301,"Olimpia München",718,99]
["Weber, Iris",301,"Olimpia München",9,100]
["Weberstetter, Illa",301,"Olimpia München",8,101]
["Weberstetter, Robert",301,"Olimpia München",10,102]
["Widekind, Alexander von",301,"Olimpia München",716,4]
["Woite, Martin",301,"Olimpia München",14,104]
["Yurtsavan, Haluk",301,"Olimpia München",559,105]
["Zitzelsperger, Wolfdieter",301,"Olimpia München",726,106]
["Baas, Jurrian Bryan",302,"PBC München-West",385,""]
["Bembenek, Claus",302,"PBC München-West",393,""]
["Bornemann, Florian",302,"PBC München-West",400,""]
["Brosig, Hans-Jürgen",302,"PBC München-West",374,1]
["Carnovalini, Alberto",302,"PBC München-West",59,""]
["Dellekönig, Markus",302,"PBC München-West",358,""]
["Dyczmons, Andrè",302,"PBC München-West",198,""]
["Feiler, Dieter",302,"PBC München-West",399,""]
["Foukis, Elias",302,"PBC München-West",388,9]
["Hadzibegovic, Adnan",302,"PBC München-West",395,""]
["Hofmeier, Andreas",302,"PBC München-West",398,""]
["Johannes, Andreas",302,"PBC München-West",386,""]
["Jovanovic, Danijel",302,"PBC München-West",354,""]
["Jovanovic, Kristijan",302,"PBC München-West",324,""]
["Jürgensen, Thomas",302,"PBC München-West",378,""]
["Kammerer, Edeltraud",302,"PBC München-West",392,12]
["Kammerer, Matthias",302,"PBC München-West",396,""]
["Kammerer, Susanne",302,"PBC München-West",397,11]
["Kelter, Heinz-Peter",302,"PBC München-West",377,""]
["Kilian, Gabriele",302,"PBC München-West",380,10]
["Kilian, Robert",302,"PBC München-West",390,""]
["Klaus, Patrick",302,"PBC München-West",391,""]
["Knöferl, Rudolf",302,"PBC München-West",382,6]
["Kotschate, Christian",302,"PBC München-West",401,3]
["Kotschate, Peter",302,"PBC München-West",402,4]
["Loy, Klaus",302,"PBC München-West",375,""]
["Maiblüh, Carola",302,"PBC München-West",403,14]
["Mania, Andreas",302,"PBC München-West",410,15]
["Mantscheff, Cato",302,"PBC München-West",409,8]
["Michelon, Alexander",302,"PBC München-West",404,""]
["Mullebrouck, Michel",302,"PBC München-West",365,""]
["Ottilinger, Martin",302,"PBC München-West",220,""]
["Plieske, Roger",302,"PBC München-West",356,7]
["Poeverlein, Bruno",302,"PBC München-West",42,5]
["Riedel, Sabrina",302,"PBC München-West",387,""]
["Ruetz, Mathias",302,"PBC München-West",142,""]
["Saussen, Daniel",302,"PBC München-West",405,""]
["Schowalter, Christian",302,"PBC München-West",349,""]
["Schwarzenegger, Anja",302,"PBC München-West",408,13]
["Schwarzenegger, Thomas",302,"PBC München-West",407,2]
["Segerer, Felix",302,"PBC München-West",406,17]
["Seibt, Andreas",302,"PBC München-West",225,""]
["Sincini, Daniel",302,"PBC München-West",275,""]
["Sprenger, Klaus",302,"PBC München-West",31,""]
["Troppmann, Alexander",302,"PBC München-West",389,""]
["Urbetat, Marcel",302,"PBC München-West",383,""]
["Westdickenberg, Hubertus",302,"PBC München-West",372,""]
["Zizzati, Fabio",302,"PBC München-West",411,16]
["Auzinger, Markus",336,"BC Miesbach",175,37]
["Dinges, Thorsten",336,"BC Miesbach",118,34]
["Dittrich, Marko",336,"BC Miesbach",184,4]
["Freiberger, Martin",336,"BC Miesbach",119,""]
["Gegenfurtner, Wolfgang",336,"BC Miesbach",3,2]
["Glatz, Sigrid",336,"BC Miesbach",144,10]
["Greil, Veronika",336,"BC Miesbach",164,39]
["Grigat, Norbert",336,"BC Miesbach",6,25]
["Handke, Jörg",336,"BC Miesbach",129,5]
["Jooß, Magdalena",336,"BC Miesbach",172,42]
["Jung, Andreas",336,"BC Miesbach",31,26]
["Kaiser, Markus",336,"BC Miesbach",1,1]
["Keml, Michaela",336,"BC Miesbach",7,23]
["Killer, Tobias",336,"BC Miesbach",167,40]
["Kirchmaier, Günther",336,"BC Miesbach",39,21]
["Kölbl, Ludwig",336,"BC Miesbach",109,33]
["Kollmer, Manfred",336,"BC Miesbach",77,7]
["Krix, Florian",336,"BC Miesbach",153,47]
["Kunze, Michael",336,"BC Miesbach",177,17]
["Kunze, Robert",336,"BC Miesbach",178,27]
["Lang, Andreas",336,"BC Miesbach",8,16]
["Lehmeier, Michael",336,"BC Miesbach",65,30]
["Lendlmeier, Stefan",336,"BC Miesbach",183,44]
["Leupold, Jan",336,"BC Miesbach",160,9]
["Maier, Gerhard",336,"BC Miesbach",86,""]
["Medvejsek, Florian",336,"BC Miesbach",135,49]
["Medvejsek, Karl",336,"BC Miesbach",142,36]
["Melz, Stefan",336,"BC Miesbach",50,15]
["Monz, Johann",336,"BC Miesbach",176,43]
["Neubauer, Florian",336,"BC Miesbach",99,6]
["Oechsler, Georg",336,"BC Miesbach",64,29]
["Ölschlegel, Marco",336,"BC Miesbach",180,19]
["Orlich, Bernt",336,"BC Miesbach",16,22]
["Pech, Barbara",336,"BC Miesbach",61,28]
["Pech, Christian",336,"BC Miesbach",185,45]
["Plaschka, Josef",336,"BC Miesbach",2,24]
["Rathke, Frank",336,"BC Miesbach",4,3]
["Reim, Dietmar",336,"BC Miesbach",29,20]
["Reisberger, Volker",336,"BC Miesbach",127,35]
["Sahin, Ahmet",336,"BC Miesbach",26,50]
["Schemmel, Rainer",336,"BC Miesbach",149,48]
["Schemmel, Sebastian",336,"BC Miesbach",74,8]
["Schemmel, Tobias",336,"BC Miesbach",73,13]
["Schieber, Jürgen",336,"BC Miesbach",186,12]
["Schreiner, Christian",336,"BC Miesbach",166,""]
["Schwab, Alois",336,"BC Miesbach",148,11]
["Seibald, Markus",336,"BC Miesbach",154,46]
["Seidl, Balthasar",336,"BC Miesbach",72,31]
["Spies, Rainer",336,"BC Miesbach",85,""]
["Steinlechner, Klaus",336,"BC Miesbach",101,32]
["Stülpner, Alexandra",336,"BC Miesbach",62,14]
["Wagner, Siegfried",336,"BC Miesbach",96,18]
["Weißenbacher, Michael",336,"BC Miesbach",182,41]
["Zeitler, Florian",336,"BC Miesbach",157,38]
["Angelokastritis, Ramona",360,"PBC Lerchenau",72,""]
["Atay, Mustafa",360,"PBC Lerchenau",91,1]
["Aumann, Andreas",360,"PBC Lerchenau",82,""]
["Aumann, Thomas",360,"PBC Lerchenau",83,""]
["Baumann, Hans",360,"PBC Lerchenau",61,32]
["Bürzer, Andrea",360,"PBC Lerchenau",106,13]
["Ernst, Norbert",360,"PBC Lerchenau",97,""]
["Fellner, Martin",360,"PBC Lerchenau",63,5]
["Flammer, Regine",360,"PBC Lerchenau",85,26]
["Förster, Florian",360,"PBC Lerchenau",86,30]
["Friedrich, Michael",360,"PBC Lerchenau",92,27]
["Graßl, Michael",360,"PBC Lerchenau",98,4]
["Hauke, Alfred",360,"PBC Lerchenau",9,8]
["Hecker, Andreas",360,"PBC Lerchenau",95,""]
["Heel, Michael",360,"PBC Lerchenau",94,""]
["Horvath, Rita",360,"PBC Lerchenau",96,""]
["Jompan, Ovidiu",360,"PBC Lerchenau",99,15]
["Käser, Gerhard",360,"PBC Lerchenau",100,12]
["Kegel, Alexandra",360,"PBC Lerchenau",93,21]
["Kegel, Melanie",360,"PBC Lerchenau",87,6]
["Kihrioglo, Bahadir",360,"PBC Lerchenau",107,25]
["Linha, Jaromir",360,"PBC Lerchenau",108,2]
["Noel, Gerhard",360,"PBC Lerchenau",4,7]
["Orland, Franz",360,"PBC Lerchenau",13,""]
["Ötzmann, Bernd",360,"PBC Lerchenau",105,14]
["Prietzel, Jutta",360,"PBC Lerchenau",104,""]
["Quade, Richard",360,"PBC Lerchenau",109,23]
["Roth, Andreas",360,"PBC Lerchenau",80,3]
["Scheungrab, Carola",360,"PBC Lerchenau",74,19]
["Schmid, Hans",360,"PBC Lerchenau",25,""]
["Schmidbauer, Michael",360,"PBC Lerchenau",1,22]
["Sixt, Michael",360,"PBC Lerchenau",58,10]
["Staude, Andrea",360,"PBC Lerchenau",110,24]
["Stöger, Michael",360,"PBC Lerchenau",40,17]
["Stöger, Regine",360,"PBC Lerchenau",28,16]
["Straubmeier, Gabi",360,"PBC Lerchenau",81,31]
["Truong, Due Khue",360,"PBC Lerchenau",77,18]
["Ugurelli, Ahmet",360,"PBC Lerchenau",103,11]
["Veit, Martina",360,"PBC Lerchenau",89,20]
["Veit, Ulrich",360,"PBC Lerchenau",45,""]
["Wintermann, Anthony-Eugen",360,"PBC Lerchenau",78,28]
["Zappe, Peter",360,"PBC Lerchenau",111,33]
["Zickmantel, Thomas",360,"PBC Lerchenau",101,29]
["Bleck, Heinz",386,"PP Unterhaching",117,""]
["Chiavetta, Silvestro",386,"PP Unterhaching",27,""]
["Degler, Michael",386,"PP Unterhaching",61,""]
["Di Corleto, Nicola",386,"PP Unterhaching",23,4]
["Friedl, Joachim",386,"PP Unterhaching",75,""]
["Fuchs, Reinhard",386,"PP Unterhaching",9,""]
["Graßberger, Franz",386,"PP Unterhaching",59,""]
["Graßberger, Martin",386,"PP Unterhaching",95,""]
["Gruschcyk, Mark",386,"PP Unterhaching",91,6]
["Hammele, Alexander",386,"PP Unterhaching",110,8]
["Kraumann, Patrick",386,"PP Unterhaching",103,2]
["Sollinger, Helmut sen.",386,"PP Unterhaching",14,""]
["Sollinger, Marie-Luise",386,"PP Unterhaching",114,""]
["Sollinger jun., Helmut",386,"PP Unterhaching",26,3]
["Spieler, Andreas",386,"PP Unterhaching",55,7]
["Ucluok, Cem",386,"PP Unterhaching",88,1]
["Vogt, Rüdiger",386,"PP Unterhaching",77,5]
["Walcher, Reinhard",386,"PP Unterhaching",105,""]
["Adlhart, Martin",397,"Rottach Breakers",62,4]
["Auer, Sepp",397,"Rottach Breakers",10,33]
["Aumann, Domenik",397,"Rottach Breakers",75,30]
["Behrens, Christian",397,"Rottach Breakers",2,13]
["Binder, Thomas",397,"Rottach Breakers",27,2]
["Cialdini, Caroline",397,"Rottach Breakers",86,28]
["D'Alto, Daniel Sergio",397,"Rottach Breakers",103,34]
["Deisenrieder, Domenik",397,"Rottach Breakers",101,35]
["Ehm, Marinus",397,"Rottach Breakers",99,36]
["Erkoc, Gökhan",397,"Rottach Breakers",73,25]
["Ettstaller, Rudi",397,"Rottach Breakers",96,""]
["Götschl, Andreas",397,"Rottach Breakers",77,9]
["Hausperger, Caroline",397,"Rottach Breakers",87,29]
["Hoffmann, Jens",397,"Rottach Breakers",67,24]
["Hösl, Ralph",397,"Rottach Breakers",78,31]
["Huber, Matthias",397,"Rottach Breakers",97,37]
["John-Lindenthaler, Martin",397,"Rottach Breakers",45,18]
["Kanzler, Sebastian",397,"Rottach Breakers",102,38]
["Karas, Andreas",397,"Rottach Breakers",14,16]
["Königer, Klaus",397,"Rottach Breakers",7,15]
["Kröll, Xaverl",397,"Rottach Breakers",88,32]
["Kurt, Hakan",397,"Rottach Breakers",95,40]
["Kurt, Volkan",397,"Rottach Breakers",94,39]
["Lambri, Maurizio",397,"Rottach Breakers",55,20]
["Leibig, Tobias",397,"Rottach Breakers",8,12]
["Maier, Benedikt",397,"Rottach Breakers",79,10]
["Menhofer, Seppi",397,"Rottach Breakers",5,5]
["Mulaosmanovic, Denim",397,"Rottach Breakers",57,21]
["Neumann, Hildegard",397,"Rottach Breakers",38,17]
["Oberleitner, Adrian",397,"Rottach Breakers",6,14]
["Porer, Andreas",397,"Rottach Breakers",84,27]
["Richter, Bernhard",397,"Rottach Breakers",53,7]
["Riedel, Bettina",397,"Rottach Breakers",93,41]
["Rötzer, Regina",397,"Rottach Breakers",59,22]
["Rowold, Andreas",397,"Rottach Breakers",56,3]
["Schacht, Bernd",397,"Rottach Breakers",15,11]
["Schreiner, Christian",397,"Rottach Breakers",98,42]
["Servatius, Nicole",397,"Rottach Breakers",82,8]
["Stickl, Thomas",397,"Rottach Breakers",4,6]
["Trenz, Johannes",397,"Rottach Breakers",89,43]
["Weege, Thorsten",397,"Rottach Breakers",104,44]
["Winkler, Florian",397,"Rottach Breakers",52,19]
["Zimmermann, Tobias",397,"Rottach Breakers",100,45]
["Zwickl, Florian",397,"Rottach Breakers",51,1]
["Beh, Christian",411,"PW Holzkirchen",92,""]
["Eigstler, Thomas",411,"PW Holzkirchen",107,1]
["Eiler, Margret",411,"PW Holzkirchen",21,""]
["Gabriele, Gerald",411,"PW Holzkirchen",80,""]
["Hepp, Michael",411,"PW Holzkirchen",82,""]
["Huber, Andreas",411,"PW Holzkirchen",18,4]
["Imhoff, Jan",411,"PW Holzkirchen",87,3]
["Kallup, Christian",411,"PW Holzkirchen",42,""]
["Kautz, Volker",411,"PW Holzkirchen",8,8]
["Kern, Martin",411,"PW Holzkirchen",34,""]
["März, Ivonne",411,"PW Holzkirchen",78,""]
["März, Manuela",411,"PW Holzkirchen",69,""]
["März, Mario",411,"PW Holzkirchen",70,""]
["Mayet, Karin",411,"PW Holzkirchen",58,2]
["Namyslo, Udo",411,"PW Holzkirchen",103,7]
["Pinnow, Sabine",411,"PW Holzkirchen",91,""]
["Pinnow, Sandra",411,"PW Holzkirchen",71,""]
["Schömer, Markus",411,"PW Holzkirchen",76,""]
["Schwarz, Philipp",411,"PW Holzkirchen",55,""]
["Sölch, Florian",411,"PW Holzkirchen",10,""]
["Sölch, Günther",411,"PW Holzkirchen",15,""]
["Spies, Manuela",411,"PW Holzkirchen",60,""]
["Spies, Rainer",411,"PW Holzkirchen",1,6]
["Sprenger, Klaus",411,"PW Holzkirchen",111,5]
["Thompson, Dewayne William",411,"PW Holzkirchen",28,""]
["Tjio, Travis",411,"PW Holzkirchen",110,""]
["Wolff, Harald",411,"PW Holzkirchen",56,""]
["Achenbach, Peter",425,"Gymnas München",129,""]
["Bichl, Michael",425,"Gymnas München",132,8]
["Bittner, Frank",425,"Gymnas München",105,10]
["Brettner, Marc",425,"Gymnas München",139,""]
["Christoph, Holger",425,"Gymnas München",155,4]
["Diemer, Sascha",425,"Gymnas München",109,""]
["Dymala, Jürgen",425,"Gymnas München",12,11]
["Fuchs, Markus",425,"Gymnas München",106,""]
["Hartmetz, Rainer",425,"Gymnas München",104,""]
["Heindl, Florian",425,"Gymnas München",11,""]
["Hergeth, Markus",425,"Gymnas München",124,3]
["Hirschbichler, Robert",425,"Gymnas München",71,""]
["Holzer, Christian",425,"Gymnas München",66,""]
["Huber, Michael",425,"Gymnas München",108,""]
["Jacobs, Werner",425,"Gymnas München",16,""]
["Klement, David",425,"Gymnas München",128,""]
["Knauer, Rosmarie",425,"Gymnas München",134,""]
["Kranz, Manfred",425,"Gymnas München",80,""]
["Lange, Stefanie",425,"Gymnas München",95,""]
["Langener, Michael",425,"Gymnas München",135,""]
["Lehmann, Walter",425,"Gymnas München",10,5]
["Löffler, Michael",425,"Gymnas München",100,12]
["Mack, Alexander",425,"Gymnas München",75,""]
["Maurus, Jonas",425,"Gymnas München",103,""]
["Mayer, Markus",425,"Gymnas München",107,""]
["Meir, Georg",425,"Gymnas München",84,""]
["Meir, Richard",425,"Gymnas München",137,""]
["Müller-Kern, Christian",425,"Gymnas München",127,""]
["Ömürbek, Martin",425,"Gymnas München",140,""]
["Pfitzner, Manuela",425,"Gymnas München",5,""]
["Rentsch, Marcus",425,"Gymnas München",7,""]
["Schäfer, Rudolf",425,"Gymnas München",8,""]
["Schießl, Roland",425,"Gymnas München",15,""]
["Schorscher, Ingo",425,"Gymnas München",83,""]
["Schraufstetter, Christian",425,"Gymnas München",138,""]
["Schrick, Christian",425,"Gymnas München",37,""]
["Schrick, Stefan",425,"Gymnas München",49,""]
["Schweiger, Jakob",425,"Gymnas München",56,""]
["Schweiger, Peter",425,"Gymnas München",99,""]
["Schwindt, Ralph",425,"Gymnas München",21,""]
["Seifert, Sebastian",425,"Gymnas München",115,1]
["Seifriedsberger, René",425,"Gymnas München",65,""]
["Siegl, Florian",425,"Gymnas München",36,""]
["Sommer, Andreas",425,"Gymnas München",91,""]
["Stadler, Oliver",425,"Gymnas München",52,""]
["Stadt, Gerhard",425,"Gymnas München",31,""]
["Strupf, Alexander",425,"Gymnas München",41,""]
["Struppler, Victor",425,"Gymnas München",126,""]
["Taylor, Delaney",425,"Gymnas München",97,""]
["Thoma, Christian",425,"Gymnas München",74,""]
["Tjio, Travis",425,"Gymnas München",136,""]
["Vasic, Jovan",425,"Gymnas München",6,""]
["Verhoeve, Aleksandra",425,"Gymnas München",133,9]
["Walser, Sebastian",425,"Gymnas München",130,7]
["Walter, Hardy",425,"Gymnas München",1,""]
["Warmuth, Andreas",425,"Gymnas München",123,""]
["Wiedemann, Christian",425,"Gymnas München",38,2]
["Wischner, Stefan",425,"Gymnas München",39,6]
["Wojta, Sascha",425,"Gymnas München",101,""]
["Wolf, Alexander",425,"Gymnas München",98,""]
["Zariello, Vincenzo",425,"Gymnas München",18,""]
["Zhang, Gangfeng",425,"Gymnas München",48,""]
["Zörb, Daniel",425,"Gymnas München",69,""]
["Aydin, Aytac",431,"PBC Hausham",24,1]
["Böhme, Rolf",431,"PBC Hausham",2,2]
["Büntert, Sascha",431,"PBC Hausham",62,""]
["Deisenrieder, Christian",431,"PBC Hausham",54,""]
["Feußer, Mike",431,"PBC Hausham",29,19]
["Gereg, Alexander",431,"PBC Hausham",63,11]
["Gröbmeyer, Manfred",431,"PBC Hausham",28,6]
["Grund, Franziska",431,"PBC Hausham",64,9]
["Gulic, Robert",431,"PBC Hausham",61,""]
["Hausberger, Christian",431,"PBC Hausham",6,16]
["Kehrer, Christian",431,"PBC Hausham",5,3]
["Kloiber, Florian",431,"PBC Hausham",65,18]
["Krieger, Alexander",431,"PBC Hausham",32,4]
["Kugland, Stefan",431,"PBC Hausham",66,10]
["Moritz, Christian",431,"PBC Hausham",13,14]
["Obermayr, Steffi",431,"PBC Hausham",67,""]
["Orterer, Markus",431,"PBC Hausham",8,12]
["Paskuloff, Alexander",431,"PBC Hausham",68,8]
["Reim, Christine",431,"PBC Hausham",7,17]
["Reim, Günther",431,"PBC Hausham",3,5]
["Remitschka, Walter",431,"PBC Hausham",20,""]
["Schlutius, Tanja",431,"PBC Hausham",17,7]
["Schlutius, Walter",431,"PBC Hausham",40,""]
["Schwatzer, Martin",431,"PBC Hausham",10,15]
["Sonner, Georg",431,"PBC Hausham",59,13]
["Adamczyc, Frederik",441,"Haching Hunters",51,19]
["Ambros, Ralf",441,"Haching Hunters",52,16]
["Bajohr, Janne",441,"Haching Hunters",37,12]
["Fuchs, Reinhard",441,"Haching Hunters",40,5]
["Glas, Dietmar",441,"Haching Hunters",48,8]
["Goldberg, Pavel",441,"Haching Hunters",36,10]
["Gulic, Robert",441,"Haching Hunters",53,2]
["Hilz, Peter",441,"Haching Hunters",54,""]
["Huber, Andreas",441,"Haching Hunters",49,""]
["Ittermann, Hermann",441,"Haching Hunters",1,3]
["Kalfa, Taner",441,"Haching Hunters",16,14]
["März, Mario",441,"Haching Hunters",50,4]
["Neumeier, Florian",441,"Haching Hunters",43,""]
["Nowak, Markus",441,"Haching Hunters",24,6]
["Oldja, Simone",441,"Haching Hunters",44,11]
["Salweski, Michael",441,"Haching Hunters",55,17]
["Schwarz, Franz",441,"Haching Hunters",45,15]
["Straucher, Frederik",441,"Haching Hunters",56,18]
["Voit, Martin",441,"Haching Hunters",38,13]
["Walcher, Rene",441,"Haching Hunters",57,1]
["Wegscheider, Brigitte",441,"Haching Hunters",10,9]
["Wegscheider, Renate",441,"Haching Hunters",11,7]
["Amersberger, Michael",459,"BANXX Grünwald",2,""]
["Arndt, Marc",459,"BANXX Grünwald",3,4]
["Fried, Luitpold Rudolf",459,"BANXX Grünwald",4,6]
["Gschwendtner, Alfred",459,"BANXX Grünwald",5,7]
["Harras, Roland",459,"BANXX Grünwald",6,11]
["Knallinger, Manfred",459,"BANXX Grünwald",7,1]
["Micco, Nazzareno",459,"BANXX Grünwald",8,3]
["Milenkovic, Goran",459,"BANXX Grünwald",9,2]
["Misel, Atilla",459,"BANXX Grünwald",10,12]
["Misel, Claudia",459,"BANXX Grünwald",11,""]
["Müller, Gerhard",459,"BANXX Grünwald",12,5]
["Revesz, George Michael",459,"BANXX Grünwald",13,8]
["Revesz, Ralph",459,"BANXX Grünwald",14,10]
["Schwarz, Sybille",459,"BANXX Grünwald",1,13]
["Valejo Ortega, Rafael Christian",459,"BANXX Grünwald",15,9]
["Bäcker, Thilo",461,"PH Holzkirchen",1,7]
["Bichler, Martin",461,"PH Holzkirchen",2,8]
["Coskun, Kemal",461,"PH Holzkirchen",3,9]
["Gabriele, Gerald",461,"PH Holzkirchen",4,10]
["Grad, Christian",461,"PH Holzkirchen",6,12]
["Grad, Franz",461,"PH Holzkirchen",7,13]
["Grad, Michael",461,"PH Holzkirchen",5,11]
["Haltmair, Markus",461,"PH Holzkirchen",8,5]
["Hauptstein, Gerhard",461,"PH Holzkirchen",9,14]
["Heller, Robert",461,"PH Holzkirchen",10,15]
["Hermann, Peter",461,"PH Holzkirchen",11,16]
["Hornecker, Adrian",461,"PH Holzkirchen",12,17]
["Karali, Murat",461,"PH Holzkirchen",13,18]
["Kienzle, Alexander",461,"PH Holzkirchen",14,4]
["Maier, Stefanie",461,"PH Holzkirchen",15,19]
["Rath, Michael",461,"PH Holzkirchen",16,20]
["Reim, Christine",461,"PH Holzkirchen",17,21]
["Rödig, Markus",461,"PH Holzkirchen",18,2]
["Schmidt, Stefanie",461,"PH Holzkirchen",19,22]
["Schneider, Michael",461,"PH Holzkirchen",20,6]
["Schreiner, Christian",461,"PH Holzkirchen",21,1]
["Schuster, Alim",461,"PH Holzkirchen",23,24]
["Schuster, Marius",461,"PH Holzkirchen",22,23]
["Stolz, Thomas",461,"PH Holzkirchen",24,25]
["Taubenberger, Josef",461,"PH Holzkirchen",25,26]
["Urban, Dominik",461,"PH Holzkirchen",26,27]
["Vogl, Tanja",461,"PH Holzkirchen",27,""]
["Walleitner, Maxi",461,"PH Holzkirchen",28,28]
["Zimmermann, Tobias",461,"PH Holzkirchen",29,3]
["Baltzer, Sven",145,"BC Germering",103,5]
["Blaschke, Hans Joachim",145,"BC Germering",2,9]
["Frasch, Albert",145,"BC Germering",90,""]
["Gries, Andreas",145,"BC Germering",81,12]
["Hofmann, Stefan",145,"BC Germering",55,8]
["Köhler, Holger",145,"BC Germering",82,1]
["Krafft, Wolfgang",145,"BC Germering",60,3]
["Krause, Uwe",145,"BC Germering",14,15]
["Macha, Otto",145,"BC Germering",22,14]
["Michl, Karin",145,"BC Germering",5,2]
["Peters, Reinhold",145,"BC Germering",126,11]
["Plank, Günter",145,"BC Germering",15,6]
["Rockel, Frank",145,"BC Germering",121,""]
["Rohrhofer, Christian",145,"BC Germering",92,10]
["Rusch, Michael",145,"BC Germering",50,13]
["Schneider, Heiko",145,"BC Germering",117,""]
["Sonntag, Winfried",145,"BC Germering",38,4]
["Werner, Tino",145,"BC Germering",68,7]
["Ableitner, Christoph",332,"Fürstenfeldbruck",260,""]
["Angermeier, Erwin",332,"Fürstenfeldbruck",2,""]
["Arslan, Harun",332,"Fürstenfeldbruck",154,25]
["Baier, Uwe",332,"Fürstenfeldbruck",139,22]
["Bandmann, Christoph",332,"Fürstenfeldbruck",271,""]
["Braun, Thorsten",332,"Fürstenfeldbruck",10,""]
["Christner, Stefan",332,"Fürstenfeldbruck",11,""]
["Dege, Joachim",332,"Fürstenfeldbruck",13,7]
["Duile, Christian",332,"Fürstenfeldbruck",261,13]
["Fejeregyhazy, Thomas",332,"Fürstenfeldbruck",225,""]
["Fuchs, Benedikt",332,"Fürstenfeldbruck",130,10]
["Fuchs, Severin",332,"Fürstenfeldbruck",272,""]
["Gavenciak, Michal",332,"Fürstenfeldbruck",277,20]
["Hammacher, Uwe",332,"Fürstenfeldbruck",273,""]
["Harlfinger, Clemens",332,"Fürstenfeldbruck",164,""]
["Harms, Michael",332,"Fürstenfeldbruck",275,6]
["Heilmeier, Jürgen",332,"Fürstenfeldbruck",117,16]
["Henzler, Reinhard",332,"Fürstenfeldbruck",262,""]
["Hersina, Günter",332,"Fürstenfeldbruck",28,""]
["Hinz, Matthias",332,"Fürstenfeldbruck",278,""]
["Hirschberger, Markus",332,"Fürstenfeldbruck",235,""]
["Huber, Alexander",332,"Fürstenfeldbruck",109,""]
["Hybler, Roman",332,"Fürstenfeldbruck",165,1]
["Just, Jürgen",332,"Fürstenfeldbruck",255,""]
["Kärtner, Peter",332,"Fürstenfeldbruck",264,21]
["Klein, Anita",332,"Fürstenfeldbruck",267,""]
["Klein, Stefan",332,"Fürstenfeldbruck",40,5]
["Knechtskern, Klaus",332,"Fürstenfeldbruck",123,17]
["Koch, Natalie",332,"Fürstenfeldbruck",268,""]
["Kosowsky, Markus",332,"Fürstenfeldbruck",43,""]
["Kötzner, Thomas",332,"Fürstenfeldbruck",89,8]
["Krenek, Lukas",332,"Fürstenfeldbruck",279,4]
["Lamche, Andreas",332,"Fürstenfeldbruck",280,""]
["Langfellner, Thomas",332,"Fürstenfeldbruck",258,""]
["Lanza, Antonio",332,"Fürstenfeldbruck",48,""]
["Leroy, Detlef",332,"Fürstenfeldbruck",211,12]
["Lütschg, Oliver",332,"Fürstenfeldbruck",212,18]
["Maichle, Armin",332,"Fürstenfeldbruck",281,14]
["Maier, Robert",332,"Fürstenfeldbruck",276,""]
["Ott, Manfred",332,"Fürstenfeldbruck",55,""]
["Rudolf, Florian",332,"Fürstenfeldbruck",241,""]
["Sanktjohanser, Martin",332,"Fürstenfeldbruck",220,""]
["Schellmann, Christian",332,"Fürstenfeldbruck",111,23]
["Schröder, Christian",332,"Fürstenfeldbruck",132,24]
["Seifried, Dirk",332,"Fürstenfeldbruck",173,""]
["Seigfried, Markus",332,"Fürstenfeldbruck",239,""]
["Seiler, Thomas",332,"Fürstenfeldbruck",214,""]
["Sieber, Klaus",332,"Fürstenfeldbruck",66,11]
["Sieber, Wolfgang",332,"Fürstenfeldbruck",67,19]
["Skof, Mario",332,"Fürstenfeldbruck",196,15]
["Stolka, Harald",332,"Fürstenfeldbruck",134,2]
["Strigl, Alfred",332,"Fürstenfeldbruck",259,3]
["Tobisch-Haupt, Rene",332,"Fürstenfeldbruck",240,""]
["Weiß, Andreas",332,"Fürstenfeldbruck",205,9]
["Westermayer, Matthias",332,"Fürstenfeldbruck",274,""]
["Widmann, Roland",332,"Fürstenfeldbruck",79,""]
["Wodsack, Susanne",332,"Fürstenfeldbruck",233,""]
["Wulff, Bernhard",332,"Fürstenfeldbruck",234,""]
["Baureis, Franz",356,"BSC Geretsried",147,""]
["Betz, Martin",356,"BSC Geretsried",53,""]
["Borth, Franziska",356,"BSC Geretsried",146,""]
["Eiler, Sebastian",356,"BSC Geretsried",154,""]
["Feiertag, Thomas",356,"BSC Geretsried",48,""]
["Heinzel, Helmut",356,"BSC Geretsried",52,5]
["Kafka, Michael",356,"BSC Geretsried",38,""]
["Kassler, Thomas",356,"BSC Geretsried",130,7]
["Kunstmann, Uli",356,"BSC Geretsried",106,1]
["Lanzinger, Markus",356,"BSC Geretsried",16,""]
["Lanzinger, Martina",356,"BSC Geretsried",15,12]
["März, Ivonne",356,"BSC Geretsried",155,8]
["Mayr, Josef",356,"BSC Geretsried",149,11]
["Mayr, Katharina",356,"BSC Geretsried",150,""]
["Mayr, Stefan",356,"BSC Geretsried",123,6]
["Pentenrieder, Markus",356,"BSC Geretsried",23,""]
["Perseis, Peter",356,"BSC Geretsried",24,14]
["Pichler, Ölwin",356,"BSC Geretsried",116,4]
["Podobnik, Andre",356,"BSC Geretsried",27,9]
["Pratzel, Thomas",356,"BSC Geretsried",136,13]
["Radicevic, Igor",356,"BSC Geretsried",141,3]
["Schmidts, Benjamin",356,"BSC Geretsried",156,""]
["Stephani, Markus",356,"BSC Geretsried",148,10]
["Strache, Michael",356,"BSC Geretsried",90,2]
["Weinhold, Manuel",356,"BSC Geretsried",151,""]
["Aschenwald, Roland",371,"BSV Olching",94,31]
["Brückl, Heinz",371,"BSV Olching",19,14]
["Cerreto, Francesco",371,"BSV Olching",92,7]
["Eberle, Frank",371,"BSV Olching",6,24]
["Ferlings, Holger",371,"BSV Olching",93,28]
["Flieger, Mathias",371,"BSV Olching",60,13]
["Franta, Reinhold",371,"BSV Olching",10,12]
["Gemmeke, Ronald",371,"BSV Olching",25,9]
["Grund, Dario",371,"BSV Olching",105,35]
["Günzel, Alexander",371,"BSV Olching",98,20]
["Harms, Michael",371,"BSV Olching",5,""]
["Haseneder, Sonja",371,"BSV Olching",77,36]
["Hentschel, Horst",371,"BSV Olching",26,11]
["Hering, Armin",371,"BSV Olching",57,23]
["Hestner, Stephan",371,"BSV Olching",78,8]
["Hoffmann, Andreas",371,"BSV Olching",28,32]
["Kiener, Wolfgang",371,"BSV Olching",79,22]
["König, Manfred",371,"BSV Olching",59,3]
["Konrad, Michael",371,"BSV Olching",3,21]
["Kötzner, Thomas",371,"BSV Olching",58,""]
["Krsticevic, Vlatko",371,"BSV Olching",48,4]
["Kunze, Christian",371,"BSV Olching",17,2]
["Kysela, Franz",371,"BSV Olching",12,16]
["Lauchner, Daniela",371,"BSV Olching",65,33]
["Marshall, Mark John",371,"BSV Olching",91,1]
["Neumaier, Hans",371,"BSV Olching",9,5]
["Neumaier, Joachim",371,"BSV Olching",97,26]
["Ott, Urban",371,"BSV Olching",67,19]
["Otto, Ralf",371,"BSV Olching",106,34]
["Rupp, Thomas",371,"BSV Olching",82,15]
["Schlierf, Caro",371,"BSV Olching",102,30]
["Umkehrer, Hans Karl",371,"BSV Olching",107,6]
["Varga, Peter",371,"BSV Olching",83,18]
["Wagner, Markus",371,"BSV Olching",108,10]
["Wesner, Marc",371,"BSV Olching",44,17]
["Adlag, Jan",378,"BSC Martinsried",12,4]
["Bauer, Cemil",378,"BSC Martinsried",46,5]
["Böhmer, Karl-Hans",378,"BSC Martinsried",111,""]
["Bucerius, Barbara",378,"BSC Martinsried",99,""]
["Caranica, Philipp",378,"BSC Martinsried",112,11]
["Dammann, Werner sen.",378,"BSC Martinsried",93,22]
["Demircan, Tarkan",378,"BSC Martinsried",143,""]
["Dietrich, Etienne",378,"BSC Martinsried",84,""]
["Dürrenberger, Robert",378,"BSC Martinsried",82,""]
["Dyczmons, Andrè",378,"BSC Martinsried",102,10]
["Gebert, Jakob",378,"BSC Martinsried",105,""]
["Gebert, Lisa",378,"BSC Martinsried",85,""]
["Geiser, Sybille",378,"BSC Martinsried",161,""]
["Gollowitsch, Thomas",378,"BSC Martinsried",60,2]
["Gratzl, Florian",378,"BSC Martinsried",107,""]
["Griebel, Gabriele",378,"BSC Martinsried",76,""]
["Groll, Sebastian",378,"BSC Martinsried",71,""]
["Hagl, Silvia",378,"BSC Martinsried",31,""]
["Hailer, Sebastian",378,"BSC Martinsried",123,""]
["Heckl, Angus",378,"BSC Martinsried",113,""]
["Heckl, Kelly",378,"BSC Martinsried",142,""]
["Heckl, Lothar",378,"BSC Martinsried",125,""]
["Heim, Dajana",378,"BSC Martinsried",126,""]
["Holub, Andreas",378,"BSC Martinsried",100,7]
["Holzer, Emil",378,"BSC Martinsried",131,""]
["Horche, Lutz",378,"BSC Martinsried",49,""]
["Horche, Wolfgang, Dr.",378,"BSC Martinsried",114,23]
["Jovanovic, Danijel",378,"BSC Martinsried",160,""]
["Jovanovic, Kristijan",378,"BSC Martinsried",115,9]
["Kahn-Ackermann, Philipp",378,"BSC Martinsried",128,18]
["Kaliscuk, Dragan",378,"BSC Martinsried",134,13]
["Kalkan, Kadir",378,"BSC Martinsried",162,""]
["Kässmeyer, Thomas",378,"BSC Martinsried",116,""]
["Kolb, Christian",378,"BSC Martinsried",40,16]
["Kornprobst, Patrick",378,"BSC Martinsried",108,""]
["Köster-Gangkofer, Günter",378,"BSC Martinsried",144,26]
["Kremser, Markus",378,"BSC Martinsried",13,""]
["Neumeyer, Ralf",378,"BSC Martinsried",90,""]
["Omranian, Darius",378,"BSC Martinsried",73,""]
["Omranian, Mohammad",378,"BSC Martinsried",109,25]
["Radvanyi, Manuel",378,"BSC Martinsried",163,""]
["Raffelsbauer, Dominik",378,"BSC Martinsried",62,""]
["Ranody, Peter",378,"BSC Martinsried",117,24]
["Raskopoljac, Denis",378,"BSC Martinsried",4,1]
["Rothenpieler, Katharina",378,"BSC Martinsried",127,""]
["Sahanek, Markus",378,"BSC Martinsried",34,8]
["Schmittner, Helmut",378,"BSC Martinsried",61,""]
["Schneider, Heiko",378,"BSC Martinsried",137,19]
["Schöppl, Robert",378,"BSC Martinsried",26,""]
["Schrogl, Nicki",378,"BSC Martinsried",106,6]
["Schwenter, Tobias",378,"BSC Martinsried",118,""]
["Seidl/C. Schorer, Raimund",378,"BSC Martinsried",69,""]
["Sobocan, Stefan",378,"BSC Martinsried",74,""]
["Sommer, Peer",378,"BSC Martinsried",132,17]
["Vogel, Thorsten",378,"BSC Martinsried",164,""]
["Vogt, Thomas",378,"BSC Martinsried",32,12]
["Wanner, Florian",378,"BSC Martinsried",57,14]
["Weber, Max",378,"BSC Martinsried",59,3]
["Wuest, Beat",378,"BSC Martinsried",119,""]
["Zwiesler, Jörg-Peter",378,"BSC Martinsried",136,""]
["Allhoff, Michael",384,"Wolfratshausen",39,7]
["Asenkerschbaumer, Thomas",384,"Wolfratshausen",1,""]
["Freilinger, Richard",384,"Wolfratshausen",17,10]
["Guttenberger, Armin",384,"Wolfratshausen",36,3]
["Heuschel, Alexander",384,"Wolfratshausen",37,6]
["Kalinis, Christos",384,"Wolfratshausen",38,4]
["Kasch, Gernot",384,"Wolfratshausen",30,""]
["Klostermaier, Josef",384,"Wolfratshausen",7,2]
["Leininger, Michael",384,"Wolfratshausen",35,5]
["Lüttich, Katharina",384,"Wolfratshausen",29,""]
["Pröhl, Arndt",384,"Wolfratshausen",41,8]
["Ritter, Michael",384,"Wolfratshausen",33,""]
["Siller, Matthias",384,"Wolfratshausen",40,9]
["Simon, Alexander",384,"Wolfratshausen",34,1]
["Sliwowski, Christian",384,"Wolfratshausen",13,""]
["Zaczyk, Wolfgang",384,"Wolfratshausen",14,""]
["Albrecht, Ferdinand",435,"BSV Garmisch",8,""]
["Eisenschink, Michael",435,"BSV Garmisch",9,1]
["Haggenmüller, Markus",435,"BSV Garmisch",18,4]
["Lang, Matthias",435,"BSV Garmisch",13,2]
["Lazarov, Dusko",435,"BSV Garmisch",21,""]
["Mühlstrasser, Manfred",435,"BSV Garmisch",20,6]
["Nickl, Helmut",435,"BSV Garmisch",3,5]
["Ostler, Markus",435,"BSV Garmisch",17,3]
["Völkl, Rudolf",435,"BSV Garmisch",16,""]
["Zwerger, Stefan",435,"BSV Garmisch",4,""]
["Barth, Andreas",436,"BSV PB München",32,4]
["Barth, Darinka",436,"BSV PB München",33,5]
["Bernard, Josef",436,"BSV PB München",46,24]
["Brunner, Alexandra-Tatjana",436,"BSV PB München",59,""]
["Brunner, Anuschka-Susanne",436,"BSV PB München",60,""]
["Brunner, Susanne",436,"BSV PB München",26,25]
["Büttner, Susanne",436,"BSV PB München",27,14]
["Callsen, Maximilian",436,"BSV PB München",50,""]
["Epple, Ralf",436,"BSV PB München",2,21]
["Fischer, Wolfgang",436,"BSV PB München",55,19]
["Forni, Aldo-Francesco",436,"BSV PB München",34,11]
["Forni, Cesco",436,"BSV PB München",72,16]
["Fürst, Bernhard",436,"BSV PB München",73,""]
["Fuß, Christine",436,"BSV PB München",57,27]
["Gütler, Zlatko",436,"BSV PB München",71,17]
["Hrustanbegovic, Armin",436,"BSV PB München",61,13]
["Junick, Peter",436,"BSV PB München",51,""]
["Kieser, Oliver",436,"BSV PB München",18,10]
["Kirnberger, Marcus",436,"BSV PB München",17,1]
["Kisslinger, Dieter",436,"BSV PB München",35,3]
["La Chiusa, Martina",436,"BSV PB München",75,26]
["Markou, Dimitrios",436,"BSV PB München",69,6]
["Mitsch, Peter",436,"BSV PB München",38,12]
["Mros, Enrico",436,"BSV PB München",70,""]
["Ottilinger, Martin",436,"BSV PB München",66,20]
["Petresin, Sascha",436,"BSV PB München",39,2]
["Plieske, Roger",436,"BSV PB München",29,""]
["Schlüter, Axel",436,"BSV PB München",67,23]
["Seidel, Dirk",436,"BSV PB München",74,8]
["Seifert, Michael",436,"BSV PB München",3,15]
["Stepanik, Michael",436,"BSV PB München",10,7]
["Taglauer, Klaus",436,"BSV PB München",8,22]
["Taglauer, Robert",436,"BSV PB München",63,""]
["Weickelt, Alexander",436,"BSV PB München",25,9]
["Yilmaz, Gürhan",436,"BSV PB München",64,18]
["Draga, Alexander",309,"1.PBC Memmingen",132,6]
["Fäßler, Martin",309,"1.PBC Memmingen",128,20]
["Fuchs, Joachim",309,"1.PBC Memmingen",162,18]
["Gebauer, Stefan",309,"1.PBC Memmingen",158,11]
["Hoffmann, Hubert",309,"1.PBC Memmingen",3,7]
["Kaiser, Herbert",309,"1.PBC Memmingen",134,12]
["Karg, Günther",309,"1.PBC Memmingen",40,15]
["Klesper, Peter",309,"1.PBC Memmingen",43,""]
["Kohlmayer, Harald",309,"1.PBC Memmingen",75,5]
["Köllner, Reiner",309,"1.PBC Memmingen",6,""]
["Körper, Sonja",309,"1.PBC Memmingen",148,16]
["Lietz, Frank",309,"1.PBC Memmingen",24,2]
["Lingner, Helmut",309,"1.PBC Memmingen",8,8]
["Ludwig, Oliver",309,"1.PBC Memmingen",149,""]
["Machacek, Jan",309,"1.PBC Memmingen",44,10]
["Mader, Heinz",309,"1.PBC Memmingen",106,""]
["Münsch, Egon",309,"1.PBC Memmingen",68,23]
["Nausch, Wolf-Dieter",309,"1.PBC Memmingen",100,""]
["Röck, Markus",309,"1.PBC Memmingen",150,17]
["Roth, Fabrice",309,"1.PBC Memmingen",82,13]
["Savran, Kemal",309,"1.PBC Memmingen",146,22]
["Schmidt, Volker",309,"1.PBC Memmingen",87,14]
["Schwob, Norbert",309,"1.PBC Memmingen",159,21]
["Seise, Daniela",309,"1.PBC Memmingen",160,""]
["Spitzer, Christian",309,"1.PBC Memmingen",15,1]
["Stepins, Michael",309,"1.PBC Memmingen",25,3]
["Stöhr, Siegfried",309,"1.PBC Memmingen",161,9]
["Tütem, Markus",309,"1.PBC Memmingen",88,4]
["Ullmann, Rainer",309,"1.PBC Memmingen",55,""]
["Von der Ruhr, Josef",309,"1.PBC Memmingen",56,19]
["Zanker, Michael",309,"1.PBC Memmingen",147,""]
["Aschner, Daniel",310,"PBC Mindelheim",117,35]
["Bartenschlager, Jakob",310,"PBC Mindelheim",1,24]
["Bock, Jürgen",310,"PBC Mindelheim",34,2]
["Bühler, Thomas",310,"PBC Mindelheim",24,29]
["Darabos, Sascha",310,"PBC Mindelheim",118,27]
["Daufratshofer, Christian",310,"PBC Mindelheim",78,30]
["Engel, Christian",310,"PBC Mindelheim",97,31]
["Eroglu, Soner",310,"PBC Mindelheim",105,13]
["Foschiatti, Sirikit",310,"PBC Mindelheim",106,""]
["Gebert, Manfred",310,"PBC Mindelheim",36,32]
["Gräsel, Tobias",310,"PBC Mindelheim",126,16]
["Hellwagner, Thomas",310,"PBC Mindelheim",122,10]
["Hetzl, Franz",310,"PBC Mindelheim",65,22]
["Hirn, Roman",310,"PBC Mindelheim",6,25]
["Hühnerfürst, Walter",310,"PBC Mindelheim",124,8]
["Immerz, Günther",310,"PBC Mindelheim",43,34]
["Kerler, Tim",310,"PBC Mindelheim",113,23]
["Klenner, Peter",310,"PBC Mindelheim",104,19]
["Kuhn, Dominik",310,"PBC Mindelheim",115,9]
["Linzer, Wilhelm",310,"PBC Mindelheim",51,33]
["Mayer, Wolfgang",310,"PBC Mindelheim",77,28]
["Nägele, Franz",310,"PBC Mindelheim",8,18]
["Nuscheler, Stefan",310,"PBC Mindelheim",110,6]
["Plaza, Martin",310,"PBC Mindelheim",9,36]
["Prüschenk, Thomas",310,"PBC Mindelheim",123,5]
["Renner, Jörg",310,"PBC Mindelheim",52,37]
["Riedmaier, Florian",310,"PBC Mindelheim",127,12]
["Ritter, Klaus",310,"PBC Mindelheim",73,38]
["Rogg, Christian",310,"PBC Mindelheim",95,26]
["Rogg, Hubert",310,"PBC Mindelheim",17,39]
["Rosenberg, Andreas",310,"PBC Mindelheim",120,40]
["Rosenberg, Bernd",310,"PBC Mindelheim",40,41]
["Salger, Johannes",310,"PBC Mindelheim",130,15]
["Schmid, Andreas",310,"PBC Mindelheim",88,1]
["Schmid, Andreas",310,"PBC Mindelheim",54,4]
["Schmid, Raoul",310,"PBC Mindelheim",44,""]
["Schomanek, Florian",310,"PBC Mindelheim",128,11]
["Specht, Walter",310,"PBC Mindelheim",80,7]
["Stanzel, Mario",310,"PBC Mindelheim",129,17]
["Strübel, Peter",310,"PBC Mindelheim",121,14]
["Strunz, Hans-Jürgen",310,"PBC Mindelheim",70,20]
["Vogler, Markus",310,"PBC Mindelheim",125,21]
["Wittmann, Helmut",310,"PBC Mindelheim",49,""]
["Yildirim, Hasan",310,"PBC Mindelheim",131,3]
["Amann, Thomas",313,"1.PBC Sonthofen",217,31]
["Amann, Toni",313,"1.PBC Sonthofen",208,""]
["Baude, Mario",313,"1.PBC Sonthofen",88,1]
["Baumgärtner, Sandor",313,"1.PBC Sonthofen",234,""]
["Berktold, Joachim",313,"1.PBC Sonthofen",129,""]
["Bietsch, Alexander",313,"1.PBC Sonthofen",130,""]
["Boxler, Martin",313,"1.PBC Sonthofen",2,7]
["Braun, Alexander",313,"1.PBC Sonthofen",89,""]
["Bucher, Thomas",313,"1.PBC Sonthofen",40,15]
["Buhl, Tobias",313,"1.PBC Sonthofen",139,""]
["Denz, Hubert",313,"1.PBC Sonthofen",192,""]
["Dürr, Uwe",313,"1.PBC Sonthofen",161,""]
["Eckel, Peter",313,"1.PBC Sonthofen",230,27]
["Egger, Bernd",313,"1.PBC Sonthofen",91,2]
["Egger, Dietmar",313,"1.PBC Sonthofen",3,18]
["Egger, Edmund",313,"1.PBC Sonthofen",4,21]
["Egger, Gabriele",313,"1.PBC Sonthofen",116,34]
["Ehrle, Roland",313,"1.PBC Sonthofen",5,19]
["Fischer, Manfred",313,"1.PBC Sonthofen",6,11]
["Florek, Klaus",313,"1.PBC Sonthofen",7,30]
["Fontain, Marcel",313,"1.PBC Sonthofen",196,""]
["Fontain, Robert",313,"1.PBC Sonthofen",8,20]
["Freiwald, Ingrid",313,"1.PBC Sonthofen",120,""]
["Freiwald, Stefan",313,"1.PBC Sonthofen",25,""]
["Frisch, Wolfgang",313,"1.PBC Sonthofen",141,""]
["Fuhrmann, Roland",313,"1.PBC Sonthofen",142,""]
["Glas, Birgit",313,"1.PBC Sonthofen",96,28]
["Haber, Roland",313,"1.PBC Sonthofen",133,""]
["Halang, Günther",313,"1.PBC Sonthofen",231,25]
["Happach, Bernd",313,"1.PBC Sonthofen",219,33]
["Haug, Rupert",313,"1.PBC Sonthofen",98,16]
["Hehl, Reinhold",313,"1.PBC Sonthofen",9,""]
["Höchenberger, Rudolf",313,"1.PBC Sonthofen",11,3]
["Immler, Ludwig",313,"1.PBC Sonthofen",53,""]
["Jahnke, Felix",313,"1.PBC Sonthofen",197,35]
["Jordan, Markus",313,"1.PBC Sonthofen",125,""]
["Kellenberger, Stefan",313,"1.PBC Sonthofen",13,13]
["Klages, Dirk",313,"1.PBC Sonthofen",211,12]
["Klein, Roland",313,"1.PBC Sonthofen",222,9]
["Knapp, Alexander",313,"1.PBC Sonthofen",26,32]
["Köhler, Roland",313,"1.PBC Sonthofen",168,""]
["Kopf, Walter",313,"1.PBC Sonthofen",15,""]
["Kramm, Jochen",313,"1.PBC Sonthofen",57,22]
["Krause, Gerhard",313,"1.PBC Sonthofen",171,""]
["Kröcker, Katharina",313,"1.PBC Sonthofen",224,""]
["Kuisle, Herbert",313,"1.PBC Sonthofen",173,""]
["Lechl, Helga",313,"1.PBC Sonthofen",101,""]
["Mayer, Hans",313,"1.PBC Sonthofen",61,""]
["Müller, Hans-Jörg",313,"1.PBC Sonthofen",104,5]
["Neubert, Axel",313,"1.PBC Sonthofen",177,""]
["Osswald, Oliver",313,"1.PBC Sonthofen",126,""]
["Ottenbreit, Karl-Heinz",313,"1.PBC Sonthofen",152,""]
["Perzing, Harald",313,"1.PBC Sonthofen",232,26]
["Plötz, Andreas",313,"1.PBC Sonthofen",202,""]
["Regensburger, Sascha",313,"1.PBC Sonthofen",155,6]
["Riedel, Horst",313,"1.PBC Sonthofen",127,""]
["Riedel, Reinhard",313,"1.PBC Sonthofen",223,""]
["Roth, Walter",313,"1.PBC Sonthofen",212,""]
["Rusch, Herbert",313,"1.PBC Sonthofen",71,24]
["Schlachter, Matthias",313,"1.PBC Sonthofen",184,""]
["Schönwald, Robert",313,"1.PBC Sonthofen",33,14]
["Schrage, Werner",313,"1.PBC Sonthofen",75,""]
["Sedlmeier, Robert",313,"1.PBC Sonthofen",136,""]
["Sobolowski, Michael",313,"1.PBC Sonthofen",221,""]
["Sonntag, Wilfried",313,"1.PBC Sonthofen",20,10]
["Sprinkart, Peter",313,"1.PBC Sonthofen",233,23]
["Steiner, Wolfgang",313,"1.PBC Sonthofen",77,""]
["Stengel, Christian",313,"1.PBC Sonthofen",109,""]
["Stich, Dieter",313,"1.PBC Sonthofen",227,29]
["Stierle, Jakob",313,"1.PBC Sonthofen",205,""]
["Stöhr, Alexander",313,"1.PBC Sonthofen",228,8]
["Westermair, Dieter",313,"1.PBC Sonthofen",23,17]
["Wiblishauser, Fabian",313,"1.PBC Sonthofen",214,37]
["Wiblishauser, Marc",313,"1.PBC Sonthofen",215,36]
["Will, Rüdiger",313,"1.PBC Sonthofen",24,4]
["Wimmer, Karl-Heinz",313,"1.PBC Sonthofen",190,""]
["Wundrak, Horst",313,"1.PBC Sonthofen",113,38]
["Zeller, Ludwig",313,"1.PBC Sonthofen",114,""]
["Zint, Bernhard",313,"1.PBC Sonthofen",229,""]
["Zint, Jürgen",313,"1.PBC Sonthofen",216,""]
["Adler, Andre",322,"Fort. Sonthofen",146,""]
["Adler, Pascal",322,"Fort. Sonthofen",145,""]
["Bambach, Burkhard",322,"Fort. Sonthofen",3,5]
["Baumgärtner, Sandor",322,"Fort. Sonthofen",16,6]
["Binde, Christian",322,"Fort. Sonthofen",139,""]
["Binde, Frank",322,"Fort. Sonthofen",124,10]
["Binde, Sebastian",322,"Fort. Sonthofen",100,2]
["Canosa, Tomaso",322,"Fort. Sonthofen",108,""]
["Cecco, Michael",322,"Fort. Sonthofen",92,""]
["Conradi, Patrick",322,"Fort. Sonthofen",129,""]
["Dolp, Alfred",322,"Fort. Sonthofen",42,""]
["Eder, Mario",322,"Fort. Sonthofen",142,14]
["Eder, Roland",322,"Fort. Sonthofen",143,15]
["Eggenfurtner, Christian",322,"Fort. Sonthofen",119,3]
["Funke, Jürgen",322,"Fort. Sonthofen",107,""]
["Gabriel, Josef",322,"Fort. Sonthofen",7,""]
["Grütz, Reinhard",322,"Fort. Sonthofen",112,""]
["Günzler, Mario",322,"Fort. Sonthofen",140,4]
["Hiltner, Ludwig",322,"Fort. Sonthofen",113,""]
["Hofmann, Brigitte",322,"Fort. Sonthofen",104,""]
["Hofmann, Daniela",322,"Fort. Sonthofen",109,""]
["Hofmann, Reiner",322,"Fort. Sonthofen",11,7]
["Hofmann, Stefan",322,"Fort. Sonthofen",12,""]
["Jörg, Martin",322,"Fort. Sonthofen",141,16]
["Kabitz, Dieter",322,"Fort. Sonthofen",13,""]
["Krabiell, Hans-Jürgen",322,"Fort. Sonthofen",86,11]
["Kramm, Jochen",322,"Fort. Sonthofen",91,""]
["Kromer, Gerald",322,"Fort. Sonthofen",72,18]
["Mannefeld, Uwe",322,"Fort. Sonthofen",134,12]
["Mütsch, Andreas",322,"Fort. Sonthofen",20,""]
["Oehme, Claus",322,"Fort. Sonthofen",25,""]
["Rapp, Roland",322,"Fort. Sonthofen",27,1]
["Salfermoser, Christian",322,"Fort. Sonthofen",101,""]
["Scheuermann, Franz",322,"Fort. Sonthofen",132,19]
["Schmucker, Josef jun.",322,"Fort. Sonthofen",84,""]
["Schönmetzler, Mehmet",322,"Fort. Sonthofen",30,""]
["Sontheim, Thomas",322,"Fort. Sonthofen",144,13]
["Sterzer, Lydia",322,"Fort. Sonthofen",106,""]
["Stöhr, Alexander",322,"Fort. Sonthofen",147,""]
["Strobel, Brigitte",322,"Fort. Sonthofen",128,20]
["Terbeck, Monika",322,"Fort. Sonthofen",148,17]
["Terbeck, Wenz",322,"Fort. Sonthofen",138,8]
["Terbeck, Willi",322,"Fort. Sonthofen",137,9]
["Tutas, Cornelia",322,"Fort. Sonthofen",149,""]
["Voigt, Andreas",322,"Fort. Sonthofen",111,""]
["Bartl, Severin",346,"1.BC Landsberg",248,19]
["Bartl, Theresa",346,"1.BC Landsberg",249,""]
["Böhnel, Jörg",346,"1.BC Landsberg",204,24]
["Bothe, Marco",346,"1.BC Landsberg",250,20]
["Dallmair, Simon",346,"1.BC Landsberg",202,""]
["Dusch, Alexander",346,"1.BC Landsberg",153,6]
["Eder, Bernd",346,"1.BC Landsberg",252,8]
["Ehmann, Thomas",346,"1.BC Landsberg",232,""]
["Engelhardt, Alexander",346,"1.BC Landsberg",256,""]
["Ernst, Alexander",346,"1.BC Landsberg",99,""]
["Ernst, Axel",346,"1.BC Landsberg",106,12]
["Fabian, Christian",346,"1.BC Landsberg",212,""]
["Flügge, Heiko",346,"1.BC Landsberg",9,5]
["Fromm, Christian",346,"1.BC Landsberg",223,10]
["Gille, Dieter",346,"1.BC Landsberg",235,4]
["Göbel, Christian",346,"1.BC Landsberg",198,14]
["Hans, Sebastian",346,"1.BC Landsberg",151,23]
["Herold, Michaela",346,"1.BC Landsberg",257,""]
["Hertel, Oliver",346,"1.BC Landsberg",253,21]
["Hirschauer, Richard",346,"1.BC Landsberg",258,""]
["Horber, Jürgen",346,"1.BC Landsberg",141,3]
["Jodeit, Günter",346,"1.BC Landsberg",19,11]
["Kesseler, Jürgen",346,"1.BC Landsberg",22,""]
["Klatz-Schmuck, Urte",346,"1.BC Landsberg",259,""]
["Klingl, Dieter",346,"1.BC Landsberg",214,22]
["Krauß, Martin",346,"1.BC Landsberg",178,7]
["Kunesch, Richart",346,"1.BC Landsberg",260,""]
["Leydolph, Alexander",346,"1.BC Landsberg",261,9]
["Marquardt, Robert",346,"1.BC Landsberg",262,13]
["Naßl, Theresa",346,"1.BC Landsberg",254,""]
["Nüß, Gabriel",346,"1.BC Landsberg",255,""]
["Oßdorf, Sascha",346,"1.BC Landsberg",5,15]
["Otto, Christian",346,"1.BC Landsberg",218,1]
["Rauchert, Andreas",346,"1.BC Landsberg",205,""]
["Scheller, Ruth",346,"1.BC Landsberg",7,16]
["Schmenner, Frank",346,"1.BC Landsberg",8,17]
["Schnagl, Robert",346,"1.BC Landsberg",152,2]
["Schwarz, Gabriele",346,"1.BC Landsberg",242,""]
["Solygan, Bernhard",346,"1.BC Landsberg",244,18]
["Solygan, Niclas",346,"1.BC Landsberg",169,""]
["Solygan, Peter",346,"1.BC Landsberg",245,""]
["Wagner, Stephan",346,"1.BC Landsberg",247,""]
["Wappler, Tim",346,"1.BC Landsberg",201,""]
["Wunderlich, Klaus",346,"1.BC Landsberg",184,""]
["Wunderlich, Lars",346,"1.BC Landsberg",185,""]
["Ade, Roman",363,"PSC Kaufbeuren",113,""]
["Aktürk, Ufak",363,"PSC Kaufbeuren",122,""]
["Aktürk, Ugur",363,"PSC Kaufbeuren",48,7]
["Atikan, Cengiz",363,"PSC Kaufbeuren",111,""]
["Aydogdu, Ibrahim",363,"PSC Kaufbeuren",80,22]
["Bendfeldt, Mario",363,"PSC Kaufbeuren",4,""]
["Blob, Matthias",363,"PSC Kaufbeuren",101,""]
["Bubenik, Stefanie",363,"PSC Kaufbeuren",105,""]
["Coskun, Osman",363,"PSC Kaufbeuren",8,5]
["Diemer, Sascha",363,"PSC Kaufbeuren",82,""]
["Djukic, Goran",363,"PSC Kaufbeuren",100,19]
["Göppel, Thomas",363,"PSC Kaufbeuren",94,""]
["Jung, Andreas",363,"PSC Kaufbeuren",114,""]
["Kahmann, Hans-Peter",363,"PSC Kaufbeuren",97,""]
["Karakaya, Oktay",363,"PSC Kaufbeuren",106,""]
["Kesseler, Jürgen",363,"PSC Kaufbeuren",84,4]
["Köse, Ibrahim",363,"PSC Kaufbeuren",20,3]
["Leitner, Andreas",363,"PSC Kaufbeuren",115,16]
["Leitner, Waldemar",363,"PSC Kaufbeuren",116,""]
["Ludwig, Peter",363,"PSC Kaufbeuren",93,15]
["Melchior, Horst",363,"PSC Kaufbeuren",107,""]
["Morbarigazzi, Gianfranco",363,"PSC Kaufbeuren",109,20]
["Morbarigazzi, Giuliano",363,"PSC Kaufbeuren",23,""]
["Morbarigazzi, Monika",363,"PSC Kaufbeuren",46,""]
["Morbarigazzi, Sabrina",363,"PSC Kaufbeuren",49,""]
["Morbarigazzi, Simona",363,"PSC Kaufbeuren",86,""]
["Morbarigazzi, Susanne",363,"PSC Kaufbeuren",24,11]
["Nebel, Stefan",363,"PSC Kaufbeuren",117,21]
["Nier, Dirk",363,"PSC Kaufbeuren",104,12]
["Nocker, Alexander",363,"PSC Kaufbeuren",95,13]
["Ortmann, Carsten",363,"PSC Kaufbeuren",77,""]
["Ötzel, Burak",363,"PSC Kaufbeuren",123,""]
["Padula, Giancarlo",363,"PSC Kaufbeuren",87,14]
["Paulweber, Andreas",363,"PSC Kaufbeuren",96,""]
["Riso in Djukic, Silvana",363,"PSC Kaufbeuren",88,""]
["Rothärmel-Weser, Georg",363,"PSC Kaufbeuren",89,""]
["Schermann, Richard",363,"PSC Kaufbeuren",110,2]
["Schmid, Christian",363,"PSC Kaufbeuren",118,""]
["Schmid, Christian",363,"PSC Kaufbeuren",70,18]
["Schöpf, Daniel",363,"PSC Kaufbeuren",90,17]
["Schreyer, Claudia",363,"PSC Kaufbeuren",71,""]
["Stahl, Michael",363,"PSC Kaufbeuren",119,10]
["Stuber, Bernd",363,"PSC Kaufbeuren",62,6]
["Stumpf, Lothar",363,"PSC Kaufbeuren",37,1]
["Syla, Besart",363,"PSC Kaufbeuren",103,""]
["Syla, Burim",363,"PSC Kaufbeuren",102,8]
["Tulach, Timm",363,"PSC Kaufbeuren",91,""]
["Velde, Dimi",363,"PSC Kaufbeuren",120,""]
["Velde, Sergej",363,"PSC Kaufbeuren",121,""]
["Weiss, Jürgen",363,"PSC Kaufbeuren",108,9]
["Albert, Gerald",369,"Schwabmünchen",71,20]
["Bravi, Tobias",369,"Schwabmünchen",124,6]
["Engelhart, Michael",369,"Schwabmünchen",131,10]
["Geirhos, Peter",369,"Schwabmünchen",58,14]
["Hieber, Markus",369,"Schwabmünchen",132,4]
["Kodella, Ernst",369,"Schwabmünchen",12,19]
["Kugelmann, Roland",369,"Schwabmünchen",5,1]
["Kuhfittig, Christian",369,"Schwabmünchen",133,18]
["Müller, Matthias",369,"Schwabmünchen",134,15]
["Nigmann, Björn",369,"Schwabmünchen",93,7]
["Ostermeier, Alexander",369,"Schwabmünchen",135,11]
["Peller, Robert",369,"Schwabmünchen",90,5]
["Rindle, Markus",369,"Schwabmünchen",107,9]
["Schönbeck, Benjamin",369,"Schwabmünchen",136,16]
["Siebeneicher, Thomas",369,"Schwabmünchen",108,13]
["Sieber, Bernd",369,"Schwabmünchen",6,17]
["Stichler, Martin",369,"Schwabmünchen",16,3]
["Weber, Anton",369,"Schwabmünchen",39,2]
["Werner, David",369,"Schwabmünchen",66,8]
["Zech, Simon",369,"Schwabmünchen",137,12]
["Betz, Holger",387,"Untermeitingen",9,8]
["Deißer, Markus",387,"Untermeitingen",28,2]
["Dietrich, Holger",387,"Untermeitingen",32,""]
["Durner, Roland",387,"Untermeitingen",10,""]
["Groß, Michael",387,"Untermeitingen",39,5]
["Haager, Wolfgang",387,"Untermeitingen",20,9]
["Hoffmann, Stefan",387,"Untermeitingen",31,4]
["Krause, Andreas",387,"Untermeitingen",21,3]
["Pitschi, Andreas",387,"Untermeitingen",18,10]
["Pommer, Lutz",387,"Untermeitingen",38,6]
["Scherer, Robert",387,"Untermeitingen",2,1]
["Simmler, Kathrin",387,"Untermeitingen",36,11]
["Teich, Martin",387,"Untermeitingen",37,7]
["Arbter, Sylvia",422,"BC Krumbach",41,""]
["Bail, Reinhard",422,"BC Krumbach",1,5]
["Becker, Michael",422,"BC Krumbach",55,""]
["Behrndt, Betina",422,"BC Krumbach",26,""]
["Bergmann, Jürgen",422,"BC Krumbach",48,""]
["Bilanovic, Goran",422,"BC Krumbach",52,1]
["Briegl, Michael",422,"BC Krumbach",34,""]
["Elsner, Angelika",422,"BC Krumbach",4,""]
["Göbel, Ernst",422,"BC Krumbach",7,13]
["Hammerschmidt, Jürgen",422,"BC Krumbach",46,""]
["Kling, Steffen",422,"BC Krumbach",49,""]
["Kling, Werner",422,"BC Krumbach",50,3]
["Knoll, Gerhard",422,"BC Krumbach",11,2]
["Knoll, Josef",422,"BC Krumbach",12,7]
["Knoll, Manuel",422,"BC Krumbach",51,8]
["Krech, Helmut",422,"BC Krumbach",14,""]
["Kusche, Werner",422,"BC Krumbach",15,6]
["Linzer, Wilhelm",422,"BC Krumbach",18,""]
["Litke, Reiner",422,"BC Krumbach",31,12]
["Lötterle, Andreas",422,"BC Krumbach",38,""]
["Miller, Alexander",422,"BC Krumbach",53,14]
["Mohr, Dieter",422,"BC Krumbach",19,""]
["Moron, Anton",422,"BC Krumbach",35,""]
["Schmid, Carmen",422,"BC Krumbach",21,""]
["Schmid, Raoul",422,"BC Krumbach",22,10]
["Sperlich, Alexander",422,"BC Krumbach",43,11]
["Sperlich, Stefanie",422,"BC Krumbach",54,""]
["Streicher, Christian",422,"BC Krumbach",29,9]
["Weiss, Marcus",422,"BC Krumbach",39,""]
["Winter, Wolfgang",422,"BC Krumbach",25,15]
["Wittmann, Helmut",422,"BC Krumbach",27,4]
["Capellino, Daniel",437,"PC Kempten",57,14]
["Damm, Reiner",437,"PC Kempten",38,17]
["Deledda, Sylvia",437,"PC Kempten",58,""]
["Dolp, Frederic",437,"PC Kempten",76,15]
["Dreyer, Ludwig",437,"PC Kempten",59,""]
["Geist, Gerhard",437,"PC Kempten",39,22]
["Gerngroß, Mark",437,"PC Kempten",40,8]
["Gigel, Stefan",437,"PC Kempten",80,6]
["Göttlicher, Christoph",437,"PC Kempten",74,16]
["Gözen, Semsi",437,"PC Kempten",42,""]
["Greither, Simone",437,"PC Kempten",7,""]
["Grimbs, Nicole",437,"PC Kempten",75,""]
["Grimbs, Stefan",437,"PC Kempten",81,""]
["Hamatschek, Gregor",437,"PC Kempten",82,""]
["Hill, Andrea",437,"PC Kempten",60,""]
["Hill, Thomas",437,"PC Kempten",45,12]
["Hörburger, Eduard",437,"PC Kempten",10,11]
["Hull, Kevin",437,"PC Kempten",68,23]
["Jünger, Jochen",437,"PC Kempten",11,""]
["Ketterle, Kevin",437,"PC Kempten",12,19]
["Kettner, André",437,"PC Kempten",83,""]
["Kirchmaier, Alexander",437,"PC Kempten",14,9]
["Mather, Merv",437,"PC Kempten",48,3]
["Mayr, Michael",437,"PC Kempten",49,20]
["Mayr, Thomas",437,"PC Kempten",50,7]
["Merk, Maximilian",437,"PC Kempten",69,""]
["Mitzinger, Ralf",437,"PC Kempten",19,2]
["Moller, Jan",437,"PC Kempten",73,""]
["Nebling, Marcel",437,"PC Kempten",84,""]
["Neugart, Hans",437,"PC Kempten",21,""]
["Paci, Marcel",437,"PC Kempten",56,""]
["Peinze, Lina",437,"PC Kempten",77,""]
["Pientka, Oliver",437,"PC Kempten",62,""]
["Ramalho, Aguinaldo",437,"PC Kempten",78,""]
["Ricker, Michael",437,"PC Kempten",25,10]
["Röck, Markus",437,"PC Kempten",85,""]
["Salmen, Holger",437,"PC Kempten",65,13]
["Schneider, Alexander",437,"PC Kempten",29,1]
["Schuster, Peter",437,"PC Kempten",72,21]
["Stimmer, Wolfgang",437,"PC Kempten",33,4]
["Strunz, Katja",437,"PC Kempten",64,""]
["Sultanow, Peter",437,"PC Kempten",79,5]
["Teichert, Andreas",437,"PC Kempten",34,""]
["Wiesbeck, Hans",437,"PC Kempten",35,18]
["Winterholler, Hans",437,"PC Kempten",36,""]
["Ambros, Elmar",445,"BSC Füssen",48,17]
["Aschner, Mirjam",445,"BSC Füssen",62,""]
["Atan, Bahattin",445,"BSC Füssen",5,""]
["Besuch, Herbert",445,"BSC Füssen",22,19]
["Blender, Wolfgang",445,"BSC Füssen",11,""]
["Bochenska, Anja",445,"BSC Füssen",33,11]
["Brutscher, Stefan",445,"BSC Füssen",78,""]
["Carl, Werner",445,"BSC Füssen",36,16]
["Einsle, Patrick",445,"BSC Füssen",12,5]
["Einsle, Ralf",445,"BSC Füssen",13,""]
["Fleckenstein, Florian",445,"BSC Füssen",63,27]
["Fröhlich, Ulrike",445,"BSC Füssen",68,""]
["Fux, Thomas",445,"BSC Füssen",57,""]
["Ginter, Holger",445,"BSC Füssen",49,""]
["Habersetzer, Werner",445,"BSC Füssen",58,""]
["Haf, Christian",445,"BSC Füssen",47,""]
["Häfele, Manuel",445,"BSC Füssen",31,7]
["Harzer, Tristan",445,"BSC Füssen",50,8]
["Hergarten, Dietmar",445,"BSC Füssen",51,22]
["Hergarten, Gerd",445,"BSC Füssen",76,""]
["Herkommer, Ralf",445,"BSC Füssen",14,""]
["Heumann, Werner",445,"BSC Füssen",1,6]
["Hildebrandt, Stefan",445,"BSC Füssen",39,""]
["Höbel, Roman Franz",445,"BSC Füssen",69,25]
["Holland, Steven",445,"BSC Füssen",65,""]
["Kerber, Andreas",445,"BSC Füssen",34,15]
["Kloppenburg, Max",445,"BSC Füssen",67,14]
["Knop, Rene",445,"BSC Füssen",16,""]
["Ladwig, Bernd",445,"BSC Füssen",37,""]
["Leiterer, Ramona",445,"BSC Füssen",52,""]
["Lemmerz, Rainer",445,"BSC Füssen",82,20]
["Linckh, Stefan",445,"BSC Füssen",17,""]
["Lißmann, Gerald",445,"BSC Füssen",79,""]
["Lohse, Andrè",445,"BSC Füssen",74,""]
["Lukes, Manuel",445,"BSC Füssen",72,""]
["May, Thomas",445,"BSC Füssen",80,1]
["Mogalla, Christian",445,"BSC Füssen",77,""]
["Nagel, Robert",445,"BSC Füssen",70,24]
["Olschowsky, Rudolf",445,"BSC Füssen",81,4]
["Plötz, Nico",445,"BSC Füssen",86,""]
["Poppler, Christian",445,"BSC Füssen",59,""]
["Pürner, Manfred",445,"BSC Füssen",53,3]
["Ruban, Marco",445,"BSC Füssen",21,""]
["Russo, Domenik",445,"BSC Füssen",54,26]
["Sablov, Beatrice",445,"BSC Füssen",23,12]
["Schlosser, Mathias",445,"BSC Füssen",24,23]
["Schneider, Martin",445,"BSC Füssen",60,""]
["Schramm, Andreas",445,"BSC Füssen",83,21]
["Simeth, Jan",445,"BSC Füssen",8,""]
["Smith, Mike",445,"BSC Füssen",26,""]
["Smith, Mike jun.",445,"BSC Füssen",40,""]
["Sporrer, Thomas",445,"BSC Füssen",32,10]
["Spöttl, Peter",445,"BSC Füssen",61,""]
["Steger, Florian",445,"BSC Füssen",55,""]
["Steiger, Sara",445,"BSC Füssen",56,""]
["Steinacher, Johannes",445,"BSC Füssen",42,""]
["Steinacher, Siegfried",445,"BSC Füssen",7,2]
["Steiner, Christian",445,"BSC Füssen",84,""]
["Steiner, Tobias",445,"BSC Füssen",85,""]
["Stiegeler, Wolfgang",445,"BSC Füssen",27,13]
["Stockmann, Falco",445,"BSC Füssen",28,""]
["Stuchly, Alexander",445,"BSC Füssen",43,""]
["Stuchly, Markus",445,"BSC Füssen",44,""]
["Szanto, Zsanett",445,"BSC Füssen",66,""]
["Ullwer, Thomas",445,"BSC Füssen",9,""]
["Velle, Markus",445,"BSC Füssen",71,""]
["Weirather, Melanie",445,"BSC Füssen",75,28]
["Wolf, Michael",445,"BSC Füssen",30,""]
["Ziegltrum, Andreas",445,"BSC Füssen",73,""]
["Ziegltrum, Christian",445,"BSC Füssen",45,9]
["Akbas, Gabriel",23,"Augsburger BC",567,""]
["Altmann, Danny",23,"Augsburger BC",611,4]
["Bayer, Helmut",23,"Augsburger BC",513,""]
["Bridts, Lothar",23,"Augsburger BC",376,""]
["Bruder, Wolfgang",23,"Augsburger BC",356,""]
["Cesarini, Salvatore",23,"Augsburger BC",610,2]
["Cochran, Dominik",23,"Augsburger BC",563,""]
["Dagan, Nihal",23,"Augsburger BC",615,""]
["Dawson, Dennis",23,"Augsburger BC",622,""]
["Essler, Herbert",23,"Augsburger BC",25,""]
["Fabian, Manfred",23,"Augsburger BC",210,""]
["Frank, Karl",23,"Augsburger BC",67,""]
["Freudhöfer, Günter",23,"Augsburger BC",370,""]
["Frick, Stefan",23,"Augsburger BC",550,9]
["Geißler, Martin",23,"Augsburger BC",270,""]
["Gogesch, Jürgen",23,"Augsburger BC",606,""]
["Grünert, Florian",23,"Augsburger BC",561,""]
["Grünert, Peter",23,"Augsburger BC",438,""]
["Hardt, Werner",23,"Augsburger BC",78,""]
["Held, Anton",23,"Augsburger BC",556,""]
["Hoffmann, Rainer",23,"Augsburger BC",21,""]
["Hüber, Kurt",23,"Augsburger BC",580,""]
["Jähnert, Fritz",23,"Augsburger BC",581,""]
["Jeannot, Christian",23,"Augsburger BC",557,""]
["Kellinger, Christian",23,"Augsburger BC",576,""]
["Kellinger, Harald",23,"Augsburger BC",575,""]
["Kelnhofer, Anton",23,"Augsburger BC",601,""]
["Kohla, Adolf",23,"Augsburger BC",362,""]
["Komanj, Danijel",23,"Augsburger BC",624,""]
["Kraut, Johann",23,"Augsburger BC",341,""]
["Kriz, Philipp",23,"Augsburger BC",619,""]
["Kriz, Susanne",23,"Augsburger BC",614,12]
["Lai, A Sang",23,"Augsburger BC",531,""]
["Lober, Helmut",23,"Augsburger BC",460,""]
["Lutzenberger, Bryan",23,"Augsburger BC",258,""]
["Michejew, Peter",23,"Augsburger BC",23,""]
["Monaco, Fabricio",23,"Augsburger BC",617,""]
["Papadopoulos, Thomas",23,"Augsburger BC",621,11]
["Pessinger, Christian",23,"Augsburger BC",598,""]
["Pessinger, Daniel",23,"Augsburger BC",599,""]
["Pilz, Alois",23,"Augsburger BC",584,""]
["Pipitone, Giovanni",23,"Augsburger BC",609,8]
["Ramsauer, Mathias",23,"Augsburger BC",591,""]
["Refle, Andre",23,"Augsburger BC",607,1]
["Reiter, Hans Jürgen",23,"Augsburger BC",381,""]
["Reiter, Ramona",23,"Augsburger BC",625,""]
["Rimer, Andreas",23,"Augsburger BC",623,7]
["Sadlo, Josef",23,"Augsburger BC",524,""]
["Schmid, Jörg",23,"Augsburger BC",603,""]
["Schmidmeir, Helmut",23,"Augsburger BC",121,""]
["Schöpflin, Heinz Dieter",23,"Augsburger BC",585,""]
["Schosser, Thomas",23,"Augsburger BC",468,""]
["Seebauer, Erwin",23,"Augsburger BC",5,""]
["Selke, Werner",23,"Augsburger BC",149,""]
["Siani, Bernardo",23,"Augsburger BC",569,""]
["Stadler, Alfred",23,"Augsburger BC",12,""]
["Stark, Roland",23,"Augsburger BC",554,10]
["Steinbüchel, Alex",23,"Augsburger BC",263,""]
["Svarc, Ulastimil",23,"Augsburger BC",604,""]
["Täuber, Stefan",23,"Augsburger BC",414,""]
["Utz, Günter",23,"Augsburger BC",504,""]
["Vetter, Frantz",23,"Augsburger BC",620,13]
["Voinescu, Florian",23,"Augsburger BC",587,3]
["Vu, Viet Chuyen",23,"Augsburger BC",544,""]
["Walser von Syrenburg, Maximilian Philipp",23,"Augsburger BC",560,""]
["Wares, Hossein",23,"Augsburger BC",295,""]
["Welz, Josef",23,"Augsburger BC",11,""]
["Widi, Tobias",23,"Augsburger BC",605,5]
["Wolffram, Florian",23,"Augsburger BC",562,""]
["Wolffram, Werner",23,"Augsburger BC",516,""]
["Würzle, Ralf",23,"Augsburger BC",525,""]
["Zeller, Reinhard",23,"Augsburger BC",27,""]
["Ziehr, Florian",23,"Augsburger BC",568,""]
["Bachl, Norbert",146,"PBC Königsbrunn",4,8]
["Baumann, Jürgen",146,"PBC Königsbrunn",57,15]
["Böhler, Thomas",146,"PBC Königsbrunn",10,""]
["Büchler, Rick",146,"PBC Königsbrunn",105,1]
["Bürger, Peter",146,"PBC Königsbrunn",73,""]
["Edler, Bruno",146,"PBC Königsbrunn",106,2]
["Edler, Michael",146,"PBC Königsbrunn",101,3]
["Forchmin, Reiner",146,"PBC Königsbrunn",16,""]
["Hartinger, Dieter",146,"PBC Königsbrunn",18,""]
["Kristian, Martin",146,"PBC Königsbrunn",82,""]
["Lupper, Stephan",146,"PBC Königsbrunn",26,10]
["Lutzenberger, Bryan",146,"PBC Königsbrunn",27,9]
["Medla, Christian",146,"PBC Königsbrunn",95,""]
["Mitko, Andreas",146,"PBC Königsbrunn",104,""]
["Moser-Schwenk, Stefanie",146,"PBC Königsbrunn",60,""]
["Ochmann, Rainer",146,"PBC Königsbrunn",91,13]
["Passan, Wolfgang",146,"PBC Königsbrunn",94,11]
["Pokladnik, Gregor",146,"PBC Königsbrunn",108,4]
["Probst, Thomas",146,"PBC Königsbrunn",114,""]
["Schwenk, Jürgen",146,"PBC Königsbrunn",63,""]
["Spielmann, Klaus",146,"PBC Königsbrunn",44,12]
["Stock, Andreas",146,"PBC Königsbrunn",67,14]
["Tabaczyk, Arthur",146,"PBC Königsbrunn",107,6]
["Tabaczyk, Markus",146,"PBC Königsbrunn",100,5]
["Toth, Gerhard",146,"PBC Königsbrunn",80,""]
["Walter, Mathias",146,"PBC Königsbrunn",113,7]
["Gayer, Alfons",304,"PBV Bobingen",2,5]
["Gayer, Edith",304,"PBV Bobingen",20,""]
["Gayer, Josef",304,"PBV Bobingen",14,2]
["Kipka, Markus",304,"PBV Bobingen",13,1]
["Kummer, Iris",304,"PBV Bobingen",38,""]
["Mader, Claus",304,"PBV Bobingen",5,3]
["Pache, Evelyn",304,"PBV Bobingen",27,""]
["Rogg, Rainer",304,"PBV Bobingen",10,4]
["Wenzl, Robert",304,"PBV Bobingen",50,6]
["Aninger, Franz",314,"PBC Lauingen",41,1]
["Bayer, Christian",314,"PBC Lauingen",101,""]
["Becher, Michael",314,"PBC Lauingen",132,2]
["Beitinger, Herbert",314,"PBC Lauingen",50,21]
["Braun, Michael",314,"PBC Lauingen",157,""]
["Cvilj, Nenad",314,"PBC Lauingen",162,""]
["Doktor, Joachim",314,"PBC Lauingen",7,3]
["Fischer, Thomas",314,"PBC Lauingen",156,11]
["Foitl, Franz",314,"PBC Lauingen",126,""]
["Gloge, Werner",314,"PBC Lauingen",8,17]
["Grimminger, Markus",314,"PBC Lauingen",10,22]
["Gromes, Frank",314,"PBC Lauingen",56,6]
["Hofmann, Thomas",314,"PBC Lauingen",139,""]
["Holzapfel, Klaus",314,"PBC Lauingen",109,5]
["Kamm, Gabi",314,"PBC Lauingen",141,13]
["Kamm, Jürgen",314,"PBC Lauingen",11,19]
["Kling, Steffen",314,"PBC Lauingen",159,10]
["Kling, Werner",314,"PBC Lauingen",160,""]
["Kölle, Reinhard",314,"PBC Lauingen",43,16]
["Mair, Sven",314,"PBC Lauingen",83,""]
["Mayr, Guido",314,"PBC Lauingen",14,""]
["Mayr, Harald",314,"PBC Lauingen",39,""]
["Mayr, Jürgen",314,"PBC Lauingen",161,""]
["Mayr, Sonja",314,"PBC Lauingen",71,""]
["Mayr, Stefan",314,"PBC Lauingen",35,20]
["Meindl, Dieter",314,"PBC Lauingen",2,""]
["Meindl, Max",314,"PBC Lauingen",32,""]
["Meindl, Stefan",314,"PBC Lauingen",15,9]
["Müller, Markus",314,"PBC Lauingen",163,""]
["Ortner, Marco",314,"PBC Lauingen",90,""]
["Pietsch, Wolfgang",314,"PBC Lauingen",155,""]
["Raupp, Alexander",314,"PBC Lauingen",91,18]
["Reichel, Daniela",314,"PBC Lauingen",61,""]
["Rommel, Peter",314,"PBC Lauingen",93,""]
["Schöttner, Lothar",314,"PBC Lauingen",40,7]
["Schrepper, Patrick",314,"PBC Lauingen",151,12]
["Spahr, Alexander",314,"PBC Lauingen",152,8]
["Strehle, Florian",314,"PBC Lauingen",85,""]
["Strohschneider, Roland",314,"PBC Lauingen",23,""]
["Sturani, Armin",314,"PBC Lauingen",121,15]
["Suchan, Kurt",314,"PBC Lauingen",4,4]
["Wagner, Wolfgang",314,"PBC Lauingen",25,""]
["Wilke, Andreas",314,"PBC Lauingen",143,14]
["Winkler, Michael",314,"PBC Lauingen",92,""]
["Wölz, Boris",314,"PBC Lauingen",28,""]
["Ziegler, Thomas",314,"PBC Lauingen",144,""]
["Becherer, Thomas",340,"BC Haunstetten",87,""]
["Behner, Benjamin",340,"BC Haunstetten",122,""]
["Bengelmann, Stefan",340,"BC Haunstetten",156,19]
["Dehme, Claus-Dieter",340,"BC Haunstetten",151,""]
["Eder, Rainer",340,"BC Haunstetten",54,13]
["Ellenberger, Christian",340,"BC Haunstetten",91,18]
["Engelhard, Frank",340,"BC Haunstetten",153,""]
["Ernst, Stefan",340,"BC Haunstetten",92,1]
["Gjorgievski, Dragan",340,"BC Haunstetten",159,21]
["Groß, Bernd",340,"BC Haunstetten",136,6]
["Gürani, Abdurrezak",340,"BC Haunstetten",124,24]
["Hanger, Jürgen",340,"BC Haunstetten",143,11]
["Hemel, Ramona",340,"BC Haunstetten",152,""]
["Hopf, Stefan",340,"BC Haunstetten",102,20]
["Kaiser, Georg",340,"BC Haunstetten",157,25]
["Kleber, Alexander",340,"BC Haunstetten",103,""]
["Klöck, Markus",340,"BC Haunstetten",112,""]
["Meisenheimer, Bernd",340,"BC Haunstetten",88,""]
["Meister, Martin",340,"BC Haunstetten",144,""]
["Moreira, Don-Lui",340,"BC Haunstetten",60,23]
["Mork, Daniel",340,"BC Haunstetten",118,7]
["Naussed, Harald",340,"BC Haunstetten",145,26]
["Ordosch, Heinz",340,"BC Haunstetten",155,27]
["Pfeifferer, Jürgen",340,"BC Haunstetten",80,17]
["Rauschmair, Heinz",340,"BC Haunstetten",28,28]
["Ruf, Martin",340,"BC Haunstetten",64,3]
["Scherer, Marcus",340,"BC Haunstetten",111,""]
["Schosser, Thomas",340,"BC Haunstetten",160,8]
["Schurr, Michael",340,"BC Haunstetten",14,14]
["Schuster, Holger",340,"BC Haunstetten",138,2]
["Schütz, Eduard",340,"BC Haunstetten",121,""]
["Seitz, Bernhard",340,"BC Haunstetten",76,16]
["Sergl, Michael",340,"BC Haunstetten",146,""]
["Standen, Richard",340,"BC Haunstetten",117,""]
["Stock, Jörg",340,"BC Haunstetten",57,15]
["Strauch, Nikky",340,"BC Haunstetten",135,22]
["Vetsch, Andreas",340,"BC Haunstetten",158,29]
["Weber, Berthold",340,"BC Haunstetten",86,""]
["Wecker, Timo",340,"BC Haunstetten",147,""]
["Weichselbaumer, Tobias",340,"BC Haunstetten",90,4]
["Weidinger, Mark",340,"BC Haunstetten",140,5]
["Würzle, Ralf",340,"BC Haunstetten",141,10]
["Zagorac, Aleksandar",340,"BC Haunstetten",154,12]
["Zirch, Manfred",340,"BC Haunstetten",128,9]
["Baylacher, Lothar",341,"PBC Augsburg",71,6]
["Böhm, Florian",341,"PBC Augsburg",216,""]
["Eichele, Maximilian",341,"PBC Augsburg",205,""]
["Ernst, Irene",341,"PBC Augsburg",20,17]
["Grgic, Marinko",341,"PBC Augsburg",160,1]
["Gruber, Stefan",341,"PBC Augsburg",203,2]
["Gschwind, Andreas",341,"PBC Augsburg",200,21]
["Hamann, Stefan",341,"PBC Augsburg",161,12]
["Hertle, Elmar",341,"PBC Augsburg",224,""]
["Hobner, Andreas",341,"PBC Augsburg",28,""]
["Holzbrecher, Gregor",341,"PBC Augsburg",167,16]
["Karg, Günther",341,"PBC Augsburg",4,""]
["Keser, Manuel",341,"PBC Augsburg",218,11]
["Kölbl, Markus",341,"PBC Augsburg",57,7]
["Korkmazer, Bülent",341,"PBC Augsburg",184,10]
["Kussauer, Sebastian",341,"PBC Augsburg",217,20]
["Lichtenstern, Johann",341,"PBC Augsburg",201,""]
["Meister, Martin",341,"PBC Augsburg",95,3]
["Motyka, Adam",341,"PBC Augsburg",169,13]
["Nguyen, Hao",341,"PBC Augsburg",115,8]
["Opacic, Tomislav",341,"PBC Augsburg",73,""]
["Pawlitza, Markus",341,"PBC Augsburg",215,""]
["Rauh, Jürgen",341,"PBC Augsburg",78,""]
["Richter, Dominik",341,"PBC Augsburg",221,""]
["Rupp, Johann",341,"PBC Augsburg",213,""]
["Schiffmann, Heinz",341,"PBC Augsburg",76,""]
["Schmidt, Jürgen",341,"PBC Augsburg",58,15]
["Schoderer, Peter",341,"PBC Augsburg",190,9]
["Tausch, Norbert",341,"PBC Augsburg",191,14]
["Tomljanovic, Stipe",341,"PBC Augsburg",3,""]
["Uslu, Zafer",341,"PBC Augsburg",225,4]
["Vogele, Werner",341,"PBC Augsburg",15,18]
["Wiedra, Dieter",341,"PBC Augsburg",97,5]
["Winter, Manfred",341,"PBC Augsburg",77,19]
["Albanese, Marcello",348,"PBC Ulm/Neu-Ulm",315,""]
["Aldirmaz, Ahmet",348,"PBC Ulm/Neu-Ulm",308,13]
["Baude, Siegbert",348,"PBC Ulm/Neu-Ulm",54,""]
["Bellmann, Tobias",348,"PBC Ulm/Neu-Ulm",326,""]
["Böttinger, Mike",348,"PBC Ulm/Neu-Ulm",291,11]
["Brechtenbreiter, Armin",348,"PBC Ulm/Neu-Ulm",123,""]
["Bremer, Roland",348,"PBC Ulm/Neu-Ulm",275,2]
["Buchen, Marc",348,"PBC Ulm/Neu-Ulm",295,8]
["Caspers, Stefan",348,"PBC Ulm/Neu-Ulm",332,4]
["Erker, Christian",348,"PBC Ulm/Neu-Ulm",280,""]
["Gassmann, Walter",348,"PBC Ulm/Neu-Ulm",244,""]
["Gassmann, Wolfgang",348,"PBC Ulm/Neu-Ulm",322,26]
["Göser, Rainer",348,"PBC Ulm/Neu-Ulm",4,""]
["Greiner, Uli",348,"PBC Ulm/Neu-Ulm",323,23]
["Hanke, Florian",348,"PBC Ulm/Neu-Ulm",301,""]
["Harper, Kevin",348,"PBC Ulm/Neu-Ulm",327,25]
["Hausbeck, Reiner",348,"PBC Ulm/Neu-Ulm",126,""]
["Helbich, Christel",348,"PBC Ulm/Neu-Ulm",125,""]
["Hillmann, Jürgen",348,"PBC Ulm/Neu-Ulm",292,10]
["Kast, Eberhard",348,"PBC Ulm/Neu-Ulm",38,""]
["Kohler, Michael",348,"PBC Ulm/Neu-Ulm",318,""]
["Köpf, Tanja",348,"PBC Ulm/Neu-Ulm",317,18]
["Kratzenstein, Ralf",348,"PBC Ulm/Neu-Ulm",282,""]
["Kurtnacker, Olli",348,"PBC Ulm/Neu-Ulm",298,20]
["Lücking, Jessica",348,"PBC Ulm/Neu-Ulm",324,""]
["Lücking, Rebecca",348,"PBC Ulm/Neu-Ulm",328,""]
["Lücking, Reinhold",348,"PBC Ulm/Neu-Ulm",307,21]
["Lutz, Matthias",348,"PBC Ulm/Neu-Ulm",31,""]
["Mader, Martin",348,"PBC Ulm/Neu-Ulm",276,7]
["Mürner, Udo",348,"PBC Ulm/Neu-Ulm",89,1]
["Niemann, Meik",348,"PBC Ulm/Neu-Ulm",316,""]
["Otto, Markus",348,"PBC Ulm/Neu-Ulm",270,3]
["Patanant, Kidan",348,"PBC Ulm/Neu-Ulm",329,""]
["Pelda, Markus",348,"PBC Ulm/Neu-Ulm",311,17]
["Poderbach, Jürgen",348,"PBC Ulm/Neu-Ulm",330,""]
["Polzer, Natalie",348,"PBC Ulm/Neu-Ulm",299,22]
["Popeskul, Stefan",348,"PBC Ulm/Neu-Ulm",312,""]
["Rath, Florian",348,"PBC Ulm/Neu-Ulm",331,""]
["Rein, Robin",348,"PBC Ulm/Neu-Ulm",303,15]
["Renner, Tina",348,"PBC Ulm/Neu-Ulm",302,19]
["Renz, Uli",348,"PBC Ulm/Neu-Ulm",319,""]
["Schleicher, Michael",348,"PBC Ulm/Neu-Ulm",297,12]
["Schuster, Ralf",348,"PBC Ulm/Neu-Ulm",300,16]
["Schuster, Timo",348,"PBC Ulm/Neu-Ulm",314,""]
["Stecker, Karl-Heinz",348,"PBC Ulm/Neu-Ulm",44,""]
["Stehling, Andreas",348,"PBC Ulm/Neu-Ulm",325,""]
["Strobel, Stephan",348,"PBC Ulm/Neu-Ulm",217,""]
["Thomalla, Jürgen",348,"PBC Ulm/Neu-Ulm",258,9]
["Uitz, Richard",348,"PBC Ulm/Neu-Ulm",313,5]
["Uslu, Kutlu",348,"PBC Ulm/Neu-Ulm",306,14]
["Uslu, Zafer",348,"PBC Ulm/Neu-Ulm",193,""]
["Völkert, Markus",348,"PBC Ulm/Neu-Ulm",320,""]
["Winter, Marc",348,"PBC Ulm/Neu-Ulm",208,6]
["Wolf, Stefan",348,"PBC Ulm/Neu-Ulm",321,24]
["Basting, Thomas",373,"PBSC Donauwörth",35,11]
["Beck, Michael",373,"PBSC Donauwörth",137,15]
["Czeschner, Roland",373,"PBSC Donauwörth",79,""]
["Eder, Rainer",373,"PBSC Donauwörth",155,""]
["Ertel, Michael",373,"PBSC Donauwörth",118,16]
["Frankl, Bernhard",373,"PBSC Donauwörth",75,2]
["Gayer, Edith",373,"PBSC Donauwörth",175,7]
["Gommeringer, Michael",373,"PBSC Donauwörth",178,17]
["Griebat, Volker",373,"PBSC Donauwörth",68,""]
["Gschlößl, Stephan",373,"PBSC Donauwörth",95,4]
["Hagedorn, Reiner",373,"PBSC Donauwörth",61,5]
["Hattler, Herbert",373,"PBSC Donauwörth",171,""]
["Hoser, Tobias",373,"PBSC Donauwörth",141,20]
["Ihle, Steve",373,"PBSC Donauwörth",163,""]
["Jeannot, Christian",373,"PBSC Donauwörth",169,14]
["Kamitz, Matthias",373,"PBSC Donauwörth",142,12]
["Krug, Alexander",373,"PBSC Donauwörth",179,19]
["Kummer, Iris",373,"PBSC Donauwörth",177,6]
["Lechlmaier, Martina",373,"PBSC Donauwörth",150,""]
["Lürtzing, Markus",373,"PBSC Donauwörth",143,18]
["Mitsch, Günter",373,"PBSC Donauwörth",144,13]
["Mumcu, Erdinc",373,"PBSC Donauwörth",168,""]
["Oehrlein, Elfi",373,"PBSC Donauwörth",145,""]
["Oltmanns, Brigitte",373,"PBSC Donauwörth",131,""]
["Oltmanns, Eike",373,"PBSC Donauwörth",133,""]
["Pache, Evelyn",373,"PBSC Donauwörth",176,10]
["Pröll, Stefan",373,"PBSC Donauwörth",90,""]
["Rüther, Andreas",373,"PBSC Donauwörth",114,9]
["Schäferling, Alexander",373,"PBSC Donauwörth",167,""]
["Schmidt, Thomas",373,"PBSC Donauwörth",153,21]
["Schnürch, Martin",373,"PBSC Donauwörth",51,1]
["Schwarz, Thomas",373,"PBSC Donauwörth",113,""]
["Suchan, Kurt",373,"PBSC Donauwörth",1,""]
["Weingarten, Stefan",373,"PBSC Donauwörth",54,8]
["Weiß, Gero",373,"PBSC Donauwörth",27,3]
["Angelidis, Dimitrios",400,"BSC Augsburg",119,11]
["Auyeng, Michael",400,"BSC Augsburg",118,2]
["Braun, Wilhelm",400,"BSC Augsburg",27,16]
["Brehm, Benjamin",400,"BSC Augsburg",69,""]
["Clarke, Gladwin",400,"BSC Augsburg",12,""]
["Dogan, Gülnihal",400,"BSC Augsburg",120,12]
["Fritsch, Peter",400,"BSC Augsburg",110,6]
["Fritsch, Thomas",400,"BSC Augsburg",121,7]
["Grüner, Andreas",400,"BSC Augsburg",92,""]
["Hohmann, Peter",400,"BSC Augsburg",15,""]
["Kohnle, Werner",400,"BSC Augsburg",109,1]
["Leimbach, Werner",400,"BSC Augsburg",113,15]
["Malchar, Thomas",400,"BSC Augsburg",101,3]
["Mayer, Walter",400,"BSC Augsburg",122,14]
["Mittmann, Patrick",400,"BSC Augsburg",93,4]
["Münchow, Tobias",400,"BSC Augsburg",10,""]
["Naegele, Hermann",400,"BSC Augsburg",123,13]
["Pecher, Christian",400,"BSC Augsburg",102,""]
["Radojcic, Zeljko",400,"BSC Augsburg",124,5]
["Rauh, Jürgen",400,"BSC Augsburg",30,8]
["Refle, Thomas",400,"BSC Augsburg",125,17]
["Riedmann, Marco",400,"BSC Augsburg",112,20]
["Riess, Hans",400,"BSC Augsburg",35,9]
["Rupprecht, Armin",400,"BSC Augsburg",24,10]
["Seyfried, Thomas",400,"BSC Augsburg",51,""]
["Sieber, Gerhard",400,"BSC Augsburg",94,""]
["Streicher, Ute",400,"BSC Augsburg",39,""]
["Walter, Peter",400,"BSC Augsburg",38,""]
["Wiedemann, Michael",400,"BSC Augsburg",90,18]
["Wirsching, Michael",400,"BSC Augsburg",63,19]
["Arguini, Joachim",418,"BSC Weißenhorn",17,13]
["Demirkaya, Oktay",418,"BSC Weißenhorn",22,7]
["Diso, Monika",418,"BSC Weißenhorn",7,17]
["Diso, Thomas",418,"BSC Weißenhorn",24,2]
["Erisis, Izzet",418,"BSC Weißenhorn",56,3]
["Feher, Anton",418,"BSC Weißenhorn",14,15]
["Fichte, Marcus",418,"BSC Weißenhorn",12,10]
["Gärtner, Sabine",418,"BSC Weißenhorn",8,14]
["Glomb, Jochen",418,"BSC Weißenhorn",32,11]
["Heim, Enrico",418,"BSC Weißenhorn",35,8]
["Newberry, Kenneth Wyatt",418,"BSC Weißenhorn",45,1]
["Reinke, Steffen",418,"BSC Weißenhorn",43,16]
["Rudenko, Oleg",418,"BSC Weißenhorn",57,4]
["Schwarz, Marco",418,"BSC Weißenhorn",16,5]
["Schwend, Jürgen",418,"BSC Weißenhorn",27,12]
["Ulucinar, Ümit",418,"BSC Weißenhorn",49,9]
["Winter, Stefan",418,"BSC Weißenhorn",28,6]
["Abart, Roberto",424,"BSC Kissing",18,8]
["Brand, Barbara",424,"BSC Kissing",113,""]
["Brandmeier, Wolfgang",424,"BSC Kissing",19,""]
["Caspers, Stefan",424,"BSC Kissing",33,""]
["Christian, Manuela",424,"BSC Kissing",34,""]
["Christian, Werner",424,"BSC Kissing",2,4]
["Decker, Christian",424,"BSC Kissing",44,""]
["Egger, Thomas",424,"BSC Kissing",111,""]
["Fischer, Stefan",424,"BSC Kissing",20,3]
["Geller, David",424,"BSC Kissing",118,""]
["Hahn, Hans",424,"BSC Kissing",21,""]
["Hahner, Heiko",424,"BSC Kissing",6,2]
["Hahner, Kerstin",424,"BSC Kissing",22,10]
["Heichele, Robert",424,"BSC Kissing",23,7]
["Hertle, Markus",424,"BSC Kissing",24,11]
["Hintersberger, Markus",424,"BSC Kissing",104,""]
["Huber, Manfred",424,"BSC Kissing",115,""]
["Huber, Manfred",424,"BSC Kissing",25,""]
["Jaufmann, Richard",424,"BSC Kissing",70,""]
["Jüttner, Florian",424,"BSC Kissing",45,""]
["Kellner, Alexander",424,"BSC Kissing",26,14]
["Köpke, Daniel",424,"BSC Kissing",71,""]
["Krüger, Hermann",424,"BSC Kissing",28,13]
["Krüger, Holger",424,"BSC Kissing",62,12]
["Meier, Christian",424,"BSC Kissing",56,""]
["Meister, Helmut",424,"BSC Kissing",48,""]
["Miller, Stefan",424,"BSC Kissing",49,6]
["Milzarek, Christoph",424,"BSC Kissing",117,""]
["Müller, Wolfgang",424,"BSC Kissing",13,5]
["Neuhaus, Andreas",424,"BSC Kissing",112,""]
["Priller, Frank",424,"BSC Kissing",14,""]
["Röthle, David",424,"BSC Kissing",15,""]
["Schechinger, Markus",424,"BSC Kissing",35,1]
["Schoder, Georg",424,"BSC Kissing",116,""]
["Seyfried, Thomas",424,"BSC Kissing",38,""]
["Strunz, Michael",424,"BSC Kissing",16,""]
["Thoma, Jürgen",424,"BSC Kissing",39,""]
["Vötter, Markus",424,"BSC Kissing",40,""]
["Weber, Florian",424,"BSC Kissing",114,""]
["Werner, Dietmar",424,"BSC Kissing",75,9]
["Westermeier, Helmut",424,"BSC Kissing",41,""]